{"text_format":"1","workbook":"xlsx","n_sheets":14,"sheets":["Welcome","Company_Information","Lists","No_CMS","HAP_ID","CMS_Info","CMS_Detail","Limits_Detail","Summary_Report_CMS","Summary_Report_Limits","Description_of_CMS_Changes","Certification","Revisions","Worksheet Map"],"not_rendered":{"charts":0,"images":1,"macros":1,"external_links":0,"defined_names":6,"comments":0,"pivot_tables":0},"unopened":[],"bounds":{"document_bytes":16777216,"sheet_cells":100000,"rows_first":2000,"rows_last":500,"rows_between":2000,"halvings":0,"cell_chars":16384,"cell_head_chars":4096},"cells_cut":0,"cells_raw":0,"read":"whole","date_system":"1900"}

{"sheet":"Welcome","index":0,"n_rows":15,"n_cols":2,"rows_kept":15,"cut":false,"hidden":false,"merged":[]}
["DO NOT REMOVE OR EDIT INFORMATION IN ROWS 1 THROUGH 5\nFOR INTERNAL USE ONLY"]
["Template Name","63.5912 (d) Semiannual Compliance Report (Spreadsheet Template)"]
["CitationID","63.5912(d)"]
["Template Version","v1.01"]
["Last Updated Date",45391]
["Blank","OMB Control No.: 2060-0509"]
[null,"For further Paperwork Reduction Act information see: \nhttps://www.epa.gov/electronic-reporting-air-emissions/paperwork-reduction-act-pra-cedri-and-ert"]
["Blank","40 CFR Part 63, Subpart WWWW National Emission Standards for Hazardous Air Pollutants: Reinforced Plastic Composites Production - §63.5912(d) Semiannual Compliance Report Spreadsheet Template"]
[null,"Instructions for Spreadsheet Template\n\nPurpose:\nThis spreadsheet template was designed by the U.S. EPA to facilitate Semiannual Compliance reporting for facilities subject under the 40 CFR part 63, subpart WWWW National Emission Standards for Hazardous Air Pollutants: Reinforced Plastic Composites Production.  \n"]
[null,"Electronic reporting:\nElectronic submission of Semiannual Compliance Reports through the EPA's Compliance and Emissions Data Reporting Interface (CEDRI) is required under §63.5912(g). CEDRI is accessed through the EPA's Central Data Exchange (https://cdx.epa.gov).\n"]
{"$rows_left_out":6}
{"sheet":"Company_Information","index":1,"n_rows":33,"n_cols":15,"rows_kept":33,"cut":false,"hidden":false,"merged":[[10,3,10,9],[10,1,10,2]]}
[null,"DO NOT REMOVE OR EDIT INFORMATION IN ROWS 1 THROUGH 5\nFOR INTERNAL USE ONLY"]
[null,"Template Name",{"$f":"+Welcome!B2","v":"63.5912 (d) Semiannual Compliance Report (Spreadsheet Template)"}]
[null,"CitationID",{"$f":"+Welcome!B3","v":"63.5912(d)"}]
[null,"Template Version",{"$f":"+Welcome!B4","v":"v1.01"}]
[null,"Last Updated Date",{"$f":"+Welcome!B5","v":45391}]
[]
[null,"40 CFR Part 63, Subpart WWWW National Emission Standards for Hazardous Air Pollutants: Reinforced Plastic Composites Production"]
[null,"\n"]
[]
[]
{"$rows_left_out":24}
{"sheet":"Lists","index":2,"n_rows":477,"n_cols":19,"rows_kept":477,"cut":false,"hidden":true,"merged":[]}
["Num","Unit","Unitlist",null,"ApplicationMethods",null,"Num","CEM","CEMID",null,"Column1","Companylist","Column2",null,"CMSCauseslist",null,"Limits",null,"States"]
[{"$f":"+IF(B2=\"\",\"\",MAX(A1:A$1)+1)","v":""},{"$f":"IF(+HAP_ID!C24=\"\",\"\",IF(COUNTIF(HAP_ID!$C24:$C$100,HAP_ID!C24)=1,HAP_ID!C24,\"\"))","v":""},{"$f":"+IFERROR(INDEX($B$2:$B$501,MATCH(ROW()-ROW($C$1),$A$2:$A$501,0)),\"\")","v":""},null,"Atomized (Spray)",null,{"$f":"+IF(H2=\"\",\"\",MAX(G1:G$1)+1)","v":""},{"$f":"IF(+CMS_Info!D24=\"\",\"\",IF(COUNTIF(CMS_Info!$D24:$D$100,CMS_Info!D24)=1,CMS_Info!D24,\"\"))","v":""},{"$f":"+IFERROR(INDEX($H$2:$H$501,MATCH(ROW()-ROW($I$1),$G$2:$G$501,0)),\"\")","v":""},null,{"$f":"+IF(L2=\"\",\"\",MAX(K1:K$1)+1)","v":""},{"$f":"IF(Company_Information!B24=\"\",\"\",Company_Information!B24)","v":""},{"$f":"+IFERROR(INDEX($L$2:$L$11,MATCH(ROW()-ROW($M$1),$K$2:$K$11,0)),\"\")","v":""},null,"Monitoring Equipment Malfunctions",null,"Organic HAP Emissions",null,"AK"]
[{"$f":"+IF(B3=\"\",\"\",MAX(A$1:A2)+1)","v":""},{"$f":"IF(+HAP_ID!C25=\"\",\"\",IF(COUNTIF(HAP_ID!$C25:$C$100,HAP_ID!C25)=1,HAP_ID!C25,\"\"))","v":""},{"$f":"+IFERROR(INDEX($B$2:$B$501,MATCH(ROW()-ROW($C$1),$A$2:$A$501,0)),\"\")","v":""},null,"Atomized, plus vacuum bagging with roll-out",null,{"$f":"+IF(H3=\"\",\"\",MAX(G$1:G2)+1)","v":""},{"$f":"IF(+CMS_Info!D25=\"\",\"\",IF(COUNTIF(CMS_Info!$D25:$D$100,CMS_Info!D25)=1,CMS_Info!D25,\"\"))","v":""},{"$f":"+IFERROR(INDEX($H$2:$H$501,MATCH(ROW()-ROW($I$1),$G$2:$G$501,0)),\"\")","v":""},null,{"$f":"+IF(L3=\"\",\"\",MAX(K$1:K2)+1)","v":""},{"$f":"IF(Company_Information!B25=\"\",\"\",Company_Information!B25)","v":""},"",null,"Nonmonitoring Equipment Malfunctions",null,"Organic HAP Emission Reduction",null,"AL"]
[{"$f":"+IF(B4=\"\",\"\",MAX(A$1:A3)+1)","v":""},{"$f":"IF(+HAP_ID!C26=\"\",\"\",IF(COUNTIF(HAP_ID!$C26:$C$100,HAP_ID!C26)=1,HAP_ID!C26,\"\"))","v":""},"",null,"Atomized, plus vacuum bagging without roll-out",null,{"$f":"+IF(H4=\"\",\"\",MAX(G$1:G3)+1)","v":""},{"$f":"IF(+CMS_Info!D26=\"\",\"\",IF(COUNTIF(CMS_Info!$D26:$D$100,CMS_Info!D26)=1,CMS_Info!D26,\"\"))","v":""},"",null,{"$f":"+IF(L4=\"\",\"\",MAX(K$1:K3)+1)","v":""},{"$f":"IF(Company_Information!B26=\"\",\"\",Company_Information!B26)","v":""},"",null,"Quality Assurance/Quality Control Calibrations",null,"Alternative Organic HAP Emission Limits (Table 5 of Subpart WWWW)",null,"AR"]
[{"$f":"+IF(B5=\"\",\"\",MAX(A$1:A4)+1)","v":""},{"$f":"IF(+HAP_ID!C27=\"\",\"\",IF(COUNTIF(HAP_ID!$C27:$C$100,HAP_ID!C27)=1,HAP_ID!C27,\"\"))","v":""},"",null,"Nonatomized (Nonspray)",null,{"$f":"+IF(H5=\"\",\"\",MAX(G$1:G4)+1)","v":""},{"$f":"IF(+CMS_Info!D27=\"\",\"\",IF(COUNTIF(CMS_Info!$D27:$D$100,CMS_Info!D27)=1,CMS_Info!D27,\"\"))","v":""},"",null,{"$f":"+IF(L5=\"\",\"\",MAX(K$1:K4)+1)","v":""},{"$f":"IF(Company_Information!B27=\"\",\"\",Company_Information!B27)","v":""},"",null,"Other Known Causes",null,"Same Resin Across Different Operations (Table 7 of Supart WWWW)",null,"AS"]
[{"$f":"+IF(B6=\"\",\"\",MAX(A$1:A5)+1)","v":""},{"$f":"IF(+HAP_ID!C28=\"\",\"\",IF(COUNTIF(HAP_ID!$C28:$C$100,HAP_ID!C28)=1,HAP_ID!C28,\"\"))","v":""},"",null,"Nonatomized , plus vacuum bagging with roll-out",null,{"$f":"+IF(H6=\"\",\"\",MAX(G$1:G5)+1)","v":""},{"$f":"IF(+CMS_Info!D28=\"\",\"\",IF(COUNTIF(CMS_Info!$D28:$D$100,CMS_Info!D28)=1,CMS_Info!D28,\"\"))","v":""},"",null,{"$f":"+IF(L6=\"\",\"\",MAX(K$1:K5)+1)","v":""},{"$f":"IF(Company_Information!B28=\"\",\"\",Company_Information!B28)","v":""},"",null,"Other Unknown Causes",null,"Emissions Capture System - Flow Rate",null,"AZ"]
[{"$f":"+IF(B7=\"\",\"\",MAX(A$1:A6)+1)","v":""},{"$f":"IF(+HAP_ID!C29=\"\",\"\",IF(COUNTIF(HAP_ID!$C29:$C$100,HAP_ID!C29)=1,HAP_ID!C29,\"\"))","v":""},"",null,"Nonatomized, plus vacuum bagging without roll-out",null,{"$f":"+IF(H7=\"\",\"\",MAX(G$1:G6)+1)","v":""},{"$f":"IF(+CMS_Info!D29=\"\",\"\",IF(COUNTIF(CMS_Info!$D29:$D$100,CMS_Info!D29)=1,CMS_Info!D29,\"\"))","v":""},"",null,{"$f":"+IF(L7=\"\",\"\",MAX(K$1:K6)+1)","v":""},{"$f":"IF(Company_Information!B29=\"\",\"\",Company_Information!B29)","v":""},"",null,null,null,"Absorber Liquid Temperature",null,"CA"]
[{"$f":"+IF(B8=\"\",\"\",MAX(A$1:A7)+1)","v":""},{"$f":"IF(+HAP_ID!C30=\"\",\"\",IF(COUNTIF(HAP_ID!$C30:$C$100,HAP_ID!C30)=1,HAP_ID!C30,\"\"))","v":""},"",null,"Any Method",null,{"$f":"+IF(H8=\"\",\"\",MAX(G$1:G7)+1)","v":""},{"$f":"IF(+CMS_Info!D30=\"\",\"\",IF(COUNTIF(CMS_Info!$D30:$D$100,CMS_Info!D30)=1,CMS_Info!D30,\"\"))","v":""},"",null,{"$f":"+IF(L8=\"\",\"\",MAX(K$1:K7)+1)","v":""},{"$f":"IF(Company_Information!B30=\"\",\"\",Company_Information!B30)","v":""},"",null,null,null,"Absorber Specific Gravity",null,"CO"]
[{"$f":"+IF(B9=\"\",\"\",MAX(A$1:A8)+1)","v":""},{"$f":"IF(+HAP_ID!C31=\"\",\"\",IF(COUNTIF(HAP_ID!$C31:$C$100,HAP_ID!C31)=1,HAP_ID!C31,\"\"))","v":""},"",null,null,null,{"$f":"+IF(H9=\"\",\"\",MAX(G$1:G8)+1)","v":""},{"$f":"IF(+CMS_Info!D31=\"\",\"\",IF(COUNTIF(CMS_Info!$D31:$D$100,CMS_Info!D31)=1,CMS_Info!D31,\"\"))","v":""},"",null,{"$f":"+IF(L9=\"\",\"\",MAX(K$1:K8)+1)","v":""},{"$f":"IF(Company_Information!B31=\"\",\"\",Company_Information!B31)","v":""},"",null,null,null,"Condenser Exit Temperature",null,"CT"]
[{"$f":"+IF(B10=\"\",\"\",MAX(A$1:A9)+1)","v":""},{"$f":"IF(+HAP_ID!C32=\"\",\"\",IF(COUNTIF(HAP_ID!$C32:$C$100,HAP_ID!C32)=1,HAP_ID!C32,\"\"))","v":""},"",null,null,null,{"$f":"+IF(H10=\"\",\"\",MAX(G$1:G9)+1)","v":""},{"$f":"IF(+CMS_Info!D32=\"\",\"\",IF(COUNTIF(CMS_Info!$D32:$D$100,CMS_Info!D32)=1,CMS_Info!D32,\"\"))","v":""},"",null,{"$f":"+IF(L10=\"\",\"\",MAX(K$1:K9)+1)","v":""},{"$f":"IF(Company_Information!B32=\"\",\"\",Company_Information!B32)","v":""},"",null,null,null,"Carbon Absorber Regeneration Stream Flow Rate",null,"DC"]
{"$rows_left_out":468}
{"sheet":"No_CMS","index":3,"n_rows":14,"n_cols":9,"rows_kept":14,"cut":false,"hidden":false,"merged":[]}
[null,"DO NOT REMOVE OR EDIT INFORMATION IN ROWS 1 THROUGH 5\nFOR INTERNAL USE ONLY"]
[null,"Template Name",{"$f":"+Welcome!B2","v":"63.5912 (d) Semiannual Compliance Report (Spreadsheet Template)"}]
[null,"CitationID",{"$f":"+Welcome!B3","v":"63.5912(d)"}]
[null,"Template Version",{"$f":"+Welcome!B4","v":"v1.01"}]
[null,"Last Updated Date",{"$f":"+Welcome!B5","v":45391}]
[]
[null,"40 CFR Part 63, Subpart WWWW National Emission Standards for Hazardous Air Pollutants: Reinforced Plastic Composites Production"]
[null,"\n"]
[]
[]
{"$rows_left_out":5}
{"sheet":"HAP_ID","index":4,"n_rows":14,"n_cols":5,"rows_kept":14,"cut":false,"hidden":false,"merged":[]}
[null,"DO NOT REMOVE OR EDIT INFORMATION IN ROWS 1 THROUGH 5\nFOR INTERNAL USE ONLY"]
[null,"Template Name",{"$f":"+Welcome!B2","v":"63.5912 (d) Semiannual Compliance Report (Spreadsheet Template)"}]
[null,"CitationID",{"$f":"+Welcome!B3","v":"63.5912(d)"}]
[null,"Template Version",{"$f":"+Welcome!B4","v":"v1.01"}]
[null,"Last Updated Date",{"$f":"+Welcome!B5","v":45391}]
[null,"40 CFR Part 63, Subpart WWWW National Emission Standards for Hazardous Air Pollutants: Reinforced Plastic Composites Production "]
[null,"§63.5912(d) Semiannual Compliance Report Spreadsheet Template"]
[null,"\n"]
[]
[]
{"$rows_left_out":5}
{"sheet":"CMS_Info","index":5,"n_rows":14,"n_cols":5,"rows_kept":14,"cut":false,"hidden":false,"merged":[]}
[null,"DO NOT REMOVE OR EDIT INFORMATION IN ROWS 1 THROUGH 5\nFOR INTERNAL USE ONLY"]
[null,"Template Name",{"$f":"+Welcome!B2","v":"63.5912 (d) Semiannual Compliance Report (Spreadsheet Template)"}]
[null,"CitationID",{"$f":"+Welcome!B3","v":"63.5912(d)"}]
[null,"Template Version",{"$f":"+Welcome!B4","v":"v1.01"}]
[null,"Last Updated Date",{"$f":"+Welcome!B5","v":45391}]
[null,"40 CFR Part 63, Subpart WWWW National Emission Standards for Hazardous Air Pollutants: Reinforced Plastic Composites Production"]
[null,"§63.5912(d) Semiannual Compliance Report Spreadsheet Template"]
[null,"\n"]
[]
[]
{"$rows_left_out":5}
{"sheet":"CMS_Detail","index":6,"n_rows":500,"n_cols":12,"rows_kept":500,"cut":false,"hidden":false,"merged":[]}
[null,"DO NOT REMOVE OR EDIT INFORMATION IN ROWS 1 THROUGH 5\nFOR INTERNAL USE ONLY"]
[null,"Template Name",{"$f":"+Welcome!B2","v":"63.5912 (d) Semiannual Compliance Report (Spreadsheet Template)"}]
[null,"CitationID",{"$f":"+Welcome!B3","v":"63.5912(d)"}]
[null,"Template Version",{"$f":"+Welcome!B4","v":"v1.01"}]
[null,"Last Updated Date",{"$f":"+Welcome!B5","v":45391}]
[null,"40 CFR Part 63, Subpart WWWW National Emission Standards for Hazardous Air Pollutants: Reinforced Plastic Composites Production"]
[null,"§63.5912(d) Semiannual Compliance Report Spreadsheet Template"]
[null,"\n"]
[]
[]
{"$rows_left_out":491}
{"sheet":"Limits_Detail","index":7,"n_rows":500,"n_cols":11,"rows_kept":500,"cut":false,"hidden":false,"merged":[]}
[null,"DO NOT REMOVE OR EDIT INFORMATION IN ROWS 1 THROUGH 5\nFOR INTERNAL USE ONLY"]
[null,"Template Name",{"$f":"+Welcome!B2","v":"63.5912 (d) Semiannual Compliance Report (Spreadsheet Template)"}]
[null,"CitationID",{"$f":"+Welcome!B3","v":"63.5912(d)"}]
[null,"Template Version",{"$f":"+Welcome!B4","v":"v1.01"}]
[null,"Last Updated Date",{"$f":"+Welcome!B5","v":45391}]
[null,null,null,null,"40 CFR Part 63, Subpart WWWW National Emission Standards for Hazardous Air Pollutants: Reinforced Plastic Composites Production"]
[null,"40 CFR Part 63, Subpart WWWW National Emission Standards for Hazardous Air Pollutants: Reinforced Plastic Composites Production - §63.5910(c) Semiannual Compliance Report Spreadsheet Template",null,null,"§63.5912(d) Semiannual Compliance Report Spreadsheet Template"]
[null,"\n"]
[]
[]
{"$rows_left_out":491}
{"sheet":"Summary_Report_CMS","index":8,"n_rows":100,"n_cols":12,"rows_kept":100,"cut":false,"hidden":false,"merged":[]}
[null,"DO NOT REMOVE OR EDIT INFORMATION IN ROWS 1 THROUGH 5\nFOR INTERNAL USE ONLY"]
[null,"Template Name",{"$f":"+Welcome!B2","v":"63.5912 (d) Semiannual Compliance Report (Spreadsheet Template)"}]
[null,"CitationID",{"$f":"+Welcome!B3","v":"63.5912(d)"}]
[null,"Template Version",{"$f":"+Welcome!B4","v":"v1.01"}]
[null,"Last Updated Date",{"$f":"+Welcome!B5","v":45391}]
[null,"40 CFR Part 63, Subpart WWWW National Emission Standards for Hazardous Air Pollutants: Reinforced Plastic Composites Production"]
[null,"§63.5912(d) Semiannual Compliance Report Spreadsheet Template"]
[null,"\n"]
[]
[]
{"$rows_left_out":91}
{"sheet":"Summary_Report_Limits","index":9,"n_rows":100,"n_cols":11,"rows_kept":100,"cut":false,"hidden":false,"merged":[]}
[null,"DO NOT REMOVE OR EDIT INFORMATION IN ROWS 1 THROUGH 5\nFOR INTERNAL USE ONLY"]
[null,"Template Name",{"$f":"+Welcome!B2","v":"63.5912 (d) Semiannual Compliance Report (Spreadsheet Template)"}]
[null,"CitationID",{"$f":"+Welcome!B3","v":"63.5912(d)"}]
[null,"Template Version",{"$f":"+Welcome!B4","v":"v1.01"}]
[null,"Last Updated Date",{"$f":"+Welcome!B5","v":45391}]
[null,"40 CFR Part 63, Subpart WWWW National Emission Standards for Hazardous Air Pollutants: Reinforced Plastic Composites Production"]
[null,"§63.5912(d) Semiannual Compliance Report Spreadsheet Template"]
[null,"\n"]
[]
[]
{"$rows_left_out":91}
{"sheet":"Description_of_CMS_Changes","index":10,"n_rows":14,"n_cols":3,"rows_kept":14,"cut":false,"hidden":false,"merged":[]}
[null,"DO NOT REMOVE OR EDIT INFORMATION IN ROWS 1 THROUGH 5\nFOR INTERNAL USE ONLY"]
[null,"Template Name",{"$f":"+Welcome!B2","v":"63.5912 (d) Semiannual Compliance Report (Spreadsheet Template)"}]
[null,"CitationID",{"$f":"+Welcome!B3","v":"63.5912(d)"}]
[null,"Template Version",{"$f":"+Welcome!B4","v":"v1.01"}]
[null,"Last Updated Date",{"$f":"+Welcome!B5","v":45391}]
[null,"Intentionally Blank"]
[null,"40 CFR Part 63, Subpart WWWW National Emission Standards for Hazardous Air Pollutants: Reinforced Plastic Composites Production"]
[null,"§63.5912(d) Semiannual Compliance Report Spreadsheet Template"]
[null,"CPMS, CEMS, COMS, Processes, or Control Changes"]
[null,"A description of any changes in the CPMS, CEMS, COMS, processes or controls since the last semiannual reporting period."]
{"$rows_left_out":5}
{"sheet":"Certification","index":11,"n_rows":33,"n_cols":6,"rows_kept":33,"cut":false,"hidden":false,"merged":[]}
[null,"DO NOT REMOVE OR EDIT INFORMATION IN ROWS 1 THROUGH 5\nFOR INTERNAL USE ONLY"]
[null,"Template Name",{"$f":"+Welcome!B2","v":"63.5912 (d) Semiannual Compliance Report (Spreadsheet Template)"}]
[null,"CitationID",{"$f":"+Welcome!B3","v":"63.5912(d)"}]
[null,"Template Version",{"$f":"+Welcome!B4","v":"v1.01"}]
[null,"Last Updated Date",{"$f":"+Welcome!B5","v":45391}]
[]
[null,"40 CFR Part 63, Subpart WWWW National Emission Standards for Hazardous Air Pollutants: Reinforced Plastic Composites Production"]
[null,"§63.5912(d) Semiannual Compliance Report Spreadsheet Template"]
[null,"Complete this form when you have completed the semiannual compliance report."]
[]
{"$rows_left_out":24}
{"sheet":"Revisions","index":12,"n_rows":3,"n_cols":3,"rows_kept":3,"cut":false,"hidden":false,"merged":[]}
["Revision Number","Date","Revisions"]
[1,43969,"Initial Release Version"]
[1.01,45391,"Updated Welcome tab"]

{"sheet":"Worksheet Map","index":13,"n_rows":11,"n_cols":5,"rows_kept":11,"cut":false,"hidden":true,"merged":[]}
["Worksheet Name","Parent","JSON Key","Parent Primary Key","Child Foreign Key"]
["Company_Information",null,"records"]
["No_CMS","records","NoCMS","RecordId","RecordId"]
["HAP_ID","records","HAPID","RecordId","RecordId"]
["CMS_Info","records","CMSInfo","RecordId","RecordId"]
["CMS_Detail","records","CMSDetail","RecordId","RecordId"]
["Limits_Detail","records","LimitsDetail","RecordId","RecordId"]
["Summary_Report_CMS","records","SummaryReportCMS","RecordId","RecordId"]
["Summary_Report_Limits","records","SummaryReportLimits","RecordId","RecordId"]
["Description_of_CMS_Changes","records","DescriptionOfCMSChanges","RecordId","RecordId"]
{"$rows_left_out":1}