{"text_format":"1","workbook":"xlsx","n_sheets":4,"sheets":["ChecklistTracking","ChecklistWorkbook","Instructions","PMChecklist"],"not_rendered":{"charts":0,"images":3,"macros":1,"external_links":0,"defined_names":6,"comments":1,"pivot_tables":0},"unopened":[],"bounds":{"document_bytes":16777216,"sheet_cells":100000,"rows_first":2000,"rows_last":500,"rows_between":2000,"halvings":0,"cell_chars":16384,"cell_head_chars":4096},"cells_cut":0,"cells_raw":0,"read":"whole","date_system":"1900"}

{"sheet":"ChecklistTracking","index":0,"n_rows":230,"n_cols":24,"rows_kept":230,"cut":false,"hidden":true,"merged":[]}
["Print order","Checklist Category","Category Detail","Action","Preventive Maintenance","HVAC","Moisture and Mold","IPM","Green Cleaning","Materials Selection","Source Control","Energy Efficiency","Project Planning","Safety","Notes","ES+H All energy","Countx","Priority Issue","Category","PI #","Original ES+H Checlist Language","Full Language","Notes from meeting with Mervin","EPA Comments"]
[1,"Project Planning","Project Planning","Gathered feedback from the school’s faculty and staff on IAQ issues and gained an understanding of the current building status. ","x","x","x","x","x","x","x","x","x",null,null,{"$error":"#N/A"},8,"1.0 Project Planning/Integrated Design","AP",1.1000000000000001,"Gathered feedback from the school’s faculty and staff on IAQ issues and gained an understanding of the current building status. Conducted stakeholder meetings early in the design process.","AP 1.1 Gather Feedback on IAQ Conditions in the School Building\nGather feedback from the school’s faculty and staff, including the IAQ coordinator (if one exists), the custodian and the school nurse. Determine locations in the building with IAQ concerns or complaints and gain an understanding of the current building status to inform the project team. \nConduct stakeholder meetings early in the process to further identify IAQ concerns and ensure that the project meets its stated goals. Stakeholders could include, for example, teachers, administrators, nurses, maintenance staff, community leaders, parents and/or students. \nUse the information gathered in this step to guide the IAQ walkthrough inspection of AP 1.2.\nNotes:\n(1) A school’s IAQ coordinator could be any of several professions typically found in a school, including a teacher, administrator, nurse or maintenance personnel.\n(2) If data on school-specific health measures are available (e.g., asthma prevalence, absenteeism rates), they may help guide the IAQ assessment. Some states require schools to keep asthma and allergy incident reports, which also could be helpful."]
[2,"Project Planning","Project Planning","Performed a periodic building walkthrough inspection to identify environment health issues and concerns (recommend monthly inspections). ","x","x","x","x","x","x","x","x","x",null,null,{"$error":"#N/A"},8,"1.0 Project Planning/Integrated Design","AP",1.2,"Performed a building walkthrough inspection to identify IAQ issues and concerns. ","AP 1.2 Perform an IAQ Walkthrough Inspection\nPerform a building walkthrough inspection to further understand IAQ and health concerns. Review each space that will potentially be included in the project. Conduct the IAQ walkthrough inspection during normal school operating hours and occupancy conditions. \nIf a walkthrough energy audit is performed to determine energy conservation opportunities, include the IAQ walkthrough inspection as a concurrent, integrated process. \nTalk to the energy auditors and ask if they or other professionals with knowledge of the building can assist with the IAQ assessments. Ensure that the auditor/inspector determines whether the outdoor ventilation rates are sufficient and controls are functional. \nEnsure that the IAQ walkthrough inspection includes aspects of pest management to evaluate pest-specific issues (e.g., evidence of infestations, pest populations, pesticide storage). See Priority Issue 11.0 Pests for additional information. \nEnsure that the IAQ walkthrough inspection also includes aspects of moisture control (see AP 3.1).\nFor more information about IAQ walkthrough inspections, refer to EPA’s IAQ Tools for Schools Action Kit, which illustrates common IAQ problems found in schools. The Building Air Quality guide created by EPA and CDC may also be used as a resource for IAQ walkthrough inspections. Chapter 5 of the ENERGY STAR® Building Upgrade Manual provides information on examining a building and its energy-consuming equipment.","Performed a periodic building walkthrough inspection to identify environment health issues and concerns (recommend monthly inspections). "]
[3,"Project Planning","Project Planning","Defined overall project IAQ and energy goals within the context of project scope and budget.  Developed a communications plan with a clear process for addressing occupant concerns.","x","x","x","x","x","x","x","x","x",null,null,"",8,"1.0 Project Planning/Integrated Design","AP",1.3,"Defined overall project IAQ and energy goals within the context of project scope and budget.  Developed a communications plan with a clear process for addressing occupant concerns.","AP 1.3 Define General Goals and Develop a Communications Plan\nGenerally define the project scope, considering IAQ findings, energy efficiency goals and project budget. Determine whether the project will be a major renovation or addition, which will require a larger project team, or if it will be a smaller system(s) upgrade. Ensure that the project’s specifications and procurement documentation (e.g., Request for Proposals) include the specific IAQ and energy efficiency requirements. Develop a communications plan to share the project’s goals with occupants and other stakeholders, with a clear process for acknowledging and addressing their feedback and concerns. "]
[4,"Project Planning","Project Planning","Selected a project team with IAQ expertise. Included a representative from each group of stakeholders in the building, for example, teachers, administrators, nurses, maintenance staff, parents and students, if possible. When evaluating proposals, ensured the project’s IAQ and energy efficiency requirements are met and specific provisions for protecting IAQ during construction phases are included. ","x","x","x","x","x","x","x","x","x",null,null,{"$error":"#VALUE!"},8,"1.0 Project Planning/Integrated Design","AP",1.4,"Selected a project team with IAQ expertise. Included a representative from each group of stakeholders in the building, for example, teachers, administrators, nurses, maintenance staff, parents and students, if possible. When evaluating proposals, ensured the project’s IAQ and energy efficiency requirements are met and specific provisions for protecting IAQ during construction phases are included. See Appendix A for guidance on team selection.","AP 1.4 Select a Project Team\nBased on the overall goals of the project, form a project team as outlined in Appendix A. When evaluating proposals, ensure that the project’s IAQ and energy efficiency requirements are adequately addressed, and ensure architects, engineers, commissioning agents and construction teams have experience with the type of projects being considered. Ensure that proposals include specific requirements for protecting students and other occupants during the construction phases, particularly if the building is occupied during construction. Make sure that the design and construction teams include IAQ expertise.\nInclude a representative from each group of stakeholders in the building, for example, teachers, administrators, nurses, maintenance staff, parents and students, if possible. \nNote:\nIncluding school maintenance staff on the project team helps to ensure that design goals take maintenance challenges into account and that the maintenance team understands the design objectives of any new systems. School maintenance staff often can service facilities more effectively with simpler systems that are easily accessible."]
[5,"Project Planning","Project Planning","Conducted collaborative cross-functional team meetings to identify synergies between IAQ and energy-efficiency upgrades. ","x","x",null,null,null,"x","x","x","x",null,null,{"$error":"#N/A"},5,"1.0 Project Planning/Integrated Design","MA",1.1000000000000001,"Conducted collaborative cross-functional team meetings to identify synergies between IAQ and energy-efficiency upgrades. For large projects, held a Design Charrette with design professionals and representatives from the school, including IAQ coordinators, risk managers, administrators, teachers, nurses, and operations and maintenance staff.","AP 1.1 Gather Feedback on IAQ Conditions in the School Building\nGather feedback from the school’s faculty and staff, including the IAQ coordinator (if one exists), the custodian and the school nurse. Determine locations in the building with IAQ concerns or complaints and gain an understanding of the current building status to inform the project team. \nConduct stakeholder meetings early in the process to further identify IAQ concerns and ensure that the project meets its stated goals. Stakeholders could include, for example, teachers, administrators, nurses, maintenance staff, community leaders, parents and/or students. \nUse the information gathered in this step to guide the IAQ walkthrough inspection of AP 1.2.\nNotes:\n(1) A school’s IAQ coordinator could be any of several professions typically found in a school, including a teacher, administrator, nurse or maintenance personnel.\n(2) If data on school-specific health measures are available (e.g., asthma prevalence, absenteeism rates), they may help guide the IAQ assessment. Some states require schools to keep asthma and allergy incident reports, which also could be helpful."]
{"$rows_left_out":225}
{"sheet":"ChecklistWorkbook","index":1,"n_rows":237,"n_cols":23,"rows_kept":237,"cut":false,"hidden":true,"merged":[]}
["Print order","Checklist Category","Category Detail","Action","Category","Preventive Maintenance","HVAC","Moisture and Mold","IPM","Cleaning – Green Methods & Maintenance","Materials Selection","Source Control","Energy Efficiency","Project Planning","Safety","Notes","ES+H All energy","Countx","Priority Issue","PI #","Original ES+H Checlist Language","Full Language","Notes from meeting with Mervin"]
[1,"Project Planning","Project Planning","Gathered feedback from the school’s faculty and staff on IAQ issues and gained an understanding of the current building status. ","AP","x","x","x","x","x","x","x","x","x","x",null,{"$error":"#N/A"},{"$f":"COUNTIF(ChecklistWorkbook!$G2:$O2,\"x\")","v":9},"1.0 Project Planning/Integrated Design",1.1000000000000001,"Gathered feedback from the school’s faculty and staff on IAQ issues and gained an understanding of the current building status. Conducted stakeholder meetings early in the design process.","AP 1.1 Gather Feedback on IAQ Conditions in the School Building\nGather feedback from the school’s faculty and staff, including the IAQ coordinator (if one exists), the custodian and the school nurse. Determine locations in the building with IAQ concerns or complaints and gain an understanding of the current building status to inform the project team. \nConduct stakeholder meetings early in the process to further identify IAQ concerns and ensure that the project meets its stated goals. Stakeholders could include, for example, teachers, administrators, nurses, maintenance staff, community leaders, parents and/or students. \nUse the information gathered in this step to guide the IAQ walkthrough inspection of AP 1.2.\nNotes:\n(1) A school’s IAQ coordinator could be any of several professions typically found in a school, including a teacher, administrator, nurse or maintenance personnel.\n(2) If data on school-specific health measures are available (e.g., asthma prevalence, absenteeism rates), they may help guide the IAQ assessment. Some states require schools to keep asthma and allergy incident reports, which also could be helpful."]
[{"$f":"A2+1","v":2},"Project Planning","Project Planning","Performed a periodic building walkthrough inspection to identify environment health issues and concerns (recommend monthly inspections). ","AP","x","x","x","x","x","x","x","x","x","x",null,{"$error":"#N/A"},{"$f":"COUNTIF(ChecklistWorkbook!$G3:$O3,\"x\")","v":9},"1.0 Project Planning/Integrated Design",1.2,"Performed a building walkthrough inspection to identify IAQ issues and concerns. ","AP 1.2 Perform an IAQ Walkthrough Inspection\nPerform a building walkthrough inspection to further understand IAQ and health concerns. Review each space that will potentially be included in the project. Conduct the IAQ walkthrough inspection during normal school operating hours and occupancy conditions. \nIf a walkthrough energy audit is performed to determine energy conservation opportunities, include the IAQ walkthrough inspection as a concurrent, integrated process. \nTalk to the energy auditors and ask if they or other professionals with knowledge of the building can assist with the IAQ assessments. Ensure that the auditor/inspector determines whether the outdoor ventilation rates are sufficient and controls are functional. \nEnsure that the IAQ walkthrough inspection includes aspects of pest management to evaluate pest-specific issues (e.g., evidence of infestations, pest populations, pesticide storage). See Priority Issue 11.0 Pests for additional information. \nEnsure that the IAQ walkthrough inspection also includes aspects of moisture control (see AP 3.1).\nFor more information about IAQ walkthrough inspections, refer to EPA’s IAQ Tools for Schools Action Kit, which illustrates common IAQ problems found in schools. The Building Air Quality guide created by EPA and CDC may also be used as a resource for IAQ walkthrough inspections. Chapter 5 of the ENERGY STAR® Building Upgrade Manual provides information on examining a building and its energy-consuming equipment.","Performed a periodic building walkthrough inspection to identify environment health issues and concerns (recommend monthly inspections). "]
[{"$f":"A3+1","v":3},"Project Planning","Project Planning","Defined overall project IAQ and energy goals within the context of project scope and budget. Developed a communications plan with a clear process for addressing occupant concerns.","AP",null,null,null,null,null,null,null,null,null,null,null,"",{"$f":"COUNTIF(ChecklistWorkbook!$G4:$O4,\"x\")","v":0},"1.0 Project Planning/Integrated Design",1.3,"Defined overall project IAQ and energy goals within the context of project scope and budget. Developed a communications plan with a clear process for addressing occupant concerns.","AP 1.3 Define General Goals and Develop a Communications Plan\nGenerally define the project scope, considering IAQ findings, energy efficiency goals and project budget. Determine whether the project will be a major renovation or addition, which will require a larger project team, or if it will be a smaller system(s) upgrade. Ensure that the project’s specifications and procurement documentation (e.g., Request for Proposals) include the specific IAQ and energy efficiency requirements. Develop a communications plan to share the project’s goals with occupants and other stakeholders, with a clear process for acknowledging and addressing their feedback and concerns. ","Excluded check from checklist per Ellen Tohn's comment"]
[4,"Project Planning","Project Planning","Selected a project team with IAQ expertise. Included a representative from each group of stakeholders in the building, for example, teachers, administrators, nurses, maintenance staff, parents and students, if possible. When evaluating proposals, ensured the project’s IAQ and energy efficiency requirements are met and specific provisions for protecting IAQ during construction phases are included. ","AP",null,null,null,null,null,null,null,null,null,null,null,{"$error":"#VALUE!"},{"$f":"COUNTIF(ChecklistWorkbook!$G5:$O5,\"x\")","v":0},"1.0 Project Planning/Integrated Design",1.4,"Selected a project team with IAQ expertise. Included a representative from each group of stakeholders in the building, for example, teachers, administrators, nurses, maintenance staff, parents and students, if possible. When evaluating proposals, ensured the project’s IAQ and energy efficiency requirements are met and specific provisions for protecting IAQ during construction phases are included. See Appendix A for guidance on team selection.","AP 1.4 Select a Project Team\nBased on the overall goals of the project, form a project team as outlined in Appendix A. When evaluating proposals, ensure that the project’s IAQ and energy efficiency requirements are adequately addressed, and ensure architects, engineers, commissioning agents and construction teams have experience with the type of projects being considered. Ensure that proposals include specific requirements for protecting students and other occupants during the construction phases, particularly if the building is occupied during construction. Make sure that the design and construction teams include IAQ expertise.\nInclude a representative from each group of stakeholders in the building, for example, teachers, administrators, nurses, maintenance staff, parents and students, if possible. \nNote:\nIncluding school maintenance staff on the project team helps to ensure that design goals take maintenance challenges into account and that the maintenance team understands the design objectives of any new systems. School maintenance staff often can service facilities more effectively with simpler systems that are easily accessible."]
[5,"Project Planning","Project Planning","Conducted collaborative cross-functional team meetings to identify synergies between IAQ and energy-efficiency upgrades. ","MA",null,null,null,null,null,null,null,null,null,null,null,{"$error":"#N/A"},{"$f":"COUNTIF(ChecklistWorkbook!$G6:$O6,\"x\")","v":0},"1.0 Project Planning/Integrated Design",1.1000000000000001,"Conducted collaborative cross-functional team meetings to identify synergies between IAQ and energy-efficiency upgrades. For large projects, held a Design Charrette with design professionals and representatives from the school, including IAQ coordinators, risk managers, administrators, teachers, nurses, and operations and maintenance staff.","AP 1.1 Gather Feedback on IAQ Conditions in the School Building\nGather feedback from the school’s faculty and staff, including the IAQ coordinator (if one exists), the custodian and the school nurse. Determine locations in the building with IAQ concerns or complaints and gain an understanding of the current building status to inform the project team. \nConduct stakeholder meetings early in the process to further identify IAQ concerns and ensure that the project meets its stated goals. Stakeholders could include, for example, teachers, administrators, nurses, maintenance staff, community leaders, parents and/or students. \nUse the information gathered in this step to guide the IAQ walkthrough inspection of AP 1.2.\nNotes:\n(1) A school’s IAQ coordinator could be any of several professions typically found in a school, including a teacher, administrator, nurse or maintenance personnel.\n(2) If data on school-specific health measures are available (e.g., asthma prevalence, absenteeism rates), they may help guide the IAQ assessment. Some states require schools to keep asthma and allergy incident reports, which also could be helpful."]
{"$rows_left_out":232}
{"sheet":"Instructions","index":2,"n_rows":80,"n_cols":9,"rows_kept":80,"cut":false,"hidden":false,"merged":[[1,0,5,8],[36,2,36,8],[38,2,38,8],[45,2,45,8],[47,2,47,8],[40,2,40,8],[41,2,41,8],[43,2,43,8]]}
[]
["Indoor Air Quality \nPreventive Maintenance Checklist Generator\nInstructions"]
[]
[]
[]
[]
{"$rows_left_out":75}
{"sheet":"PMChecklist","index":3,"n_rows":280,"n_cols":17,"rows_kept":280,"cut":false,"hidden":false,"merged":[[0,0,0,6],[1,0,1,6],[4,0,4,1],[4,2,4,6],[2,0,2,1],[3,0,3,1]]}
["Indoor Air Quality Preventive Maintenance Checklist",null,null,null,null,null,null,null,null,null,null,null,1,"Preventive Maintenance Full",null,"Menu control cell","Table Name"]
[{"$f":"VLOOKUP(P2,M:N,2,FALSE)","v":"Preventive Maintenance Full"},null,null,null,null,null,null,null,null,null,null,null,2,"Energy Efficiency",1,1,1]
[null,null,null,null,null,"School Name:",null,null,null,null,null,null,3,"Materials Selection"]
[" Select and Customize a Checklist",null,null,null,null,"Date:",null,null,null,null,null,null,4,"Cleaning – Green Methods & Maintenance"]
["Use Filters Below\nto Customize Checklist",null,"This tool is designed to allow you to add your own checks or modify the existing checks to match your needs. \nYou may want to add additional activities related to IAQ preventive maintenance, such as those in IAQ Tools for Schools Action Kit. \nEnable macros to use this checklist customizer. Refer to Help files to learn how to enable macros for your version of MS Excel.",null,null,null,null,null,null,null,null,null,5,"HVAC"]
["Category","Category Detail","Action","Priority","Yes","N/A","Notes",null,null,null,null,null,6,"Integrated Pest Management"]
{"$rows_left_out":274}