{"text_format":"1","workbook":"xlsx","n_sheets":3,"sheets":["Read Me","Runoff Field ID-1","(locked calculator functions)"],"not_rendered":{"charts":0,"images":0,"macros":1,"external_links":0,"defined_names":3,"comments":0,"pivot_tables":0},"unopened":[],"bounds":{"document_bytes":16777216,"sheet_cells":100000,"rows_first":2000,"rows_last":500,"rows_between":2000,"halvings":0,"cell_chars":16384,"cell_head_chars":4096},"cells_cut":0,"cells_raw":0,"read":"whole","date_system":"1900"}

{"sheet":"Read Me","index":0,"n_rows":41,"n_cols":1,"rows_kept":41,"cut":false,"hidden":false,"merged":[[5,0,5,2],[7,0,7,2],[8,0,8,2],[6,0,6,2],[3,0,3,2],[4,0,4,2],[30,0,30,2],[10,0,10,2],[21,0,21,2],[25,0,25,2],[23,0,23,2],[14,0,14,2],[22,0,22,2],[24,0,24,2],[20,0,20,2],[17,0,17,2],[16,0,16,2],[15,0,15,2],[18,0,18,2],[19,0,19,2],[11,0,11,2],[0,0,0,2],[39,0,39,2],[40,0,40,2],[13,0,13,2],[38,0,38,2],[36,0,36,2],[37,0,37,2],[35,0,35,2],[33,0,33,2],[31,0,31,2],[29,0,29,2],[27,0,27,2],[32,0,32,2],[34,0,34,2],[26,0,26,2],[28,0,28,2]]}
["The calculator is a tool for informational purposes to assist the user in determining whether the necessary level of mitigation has been met before applying a pesticide product. The calculator can help assess the potential number of points available for the mitigation and mitigation relief measures entered by the user. The actual number of points achieved is dependent on design and implementation of mitigation measures in accordance with relevant criteria and standard  practices their descriptions on EPA’s Mitigation Menu Website (https://www.epa.gov/pesticides/mitigation-menu-measure-descriptions). Note that each measure in the calculator includes a link that directs you to the detailed description of each measure on this website EPA’s Mitigation Menu Website. "]
[]
["Runoff/Erosion Mitigation Calculator Version 1.0 Date 10-15-24"]
["Ecological runoff/erosion mitigation measures, efficacy and individual mitigation points reflect the Ecological Mitigation Support Document (version 1.0) and are consistent with EPA's Mitigation Menu Website at https://www.epa.gov/pesticides/mitigation-menu."]
["The mitigation and mitigation relief measures in this calculator link to their corresponding descriptions on EPA's Mitigation Menu Website. "]
["EPA's Mitigation Menu Website also includes a crosswalk document to help you understand how voluntary programs that utilize conservation practices can fulfill EPA label requirements"]
["This calculator is intended to simplify the calculation of mitigation points for an individual field/management unit.  The calculator also includes fields that can be useful for keeping track of information on a field by field basis for later use."]
["The calculator auto processes mitigation points and provides a summation of the field/management unit mitigation points.  If the user does not include entries in the \"Application Parameters\" section then the summation of points provided in the green cells at the bottom of the calculator would be applicable to all agricultural pesticides used on the field/management unit."]
["Definition of Field or Management Unit: A field or management unit is defined as the single contiguous piece of land that is managed as a single unit in production or in preparation for production of a single crop. A uniform field (continuous managed area for cultivation) may be sub-divided based upon different crops (e.g., vegetables and leafy greens) or sub-divided based upon different features (e.g., flat portion and contoured portion).  EPA's mitigation measures are applicable to the use as related to these units of management. "]
[]
["Clear All User Inputs Button - This will clear out all user inputs within the active worksheet. Once cleared, it cannot be undone. The user would need to reenter the information."]
["Create New Worksheet for another Field/Management Unit Button - This will prompt the user to enter a new field/management unit identification name. It will create a new worksheet named with the user supplied identification name. The new worksheet is cleared out of all user inputs. "]
[]
["Description of sections within the calculator"]
["General Field/Management Unit Information (Optional Section)"]
["This calculator is intended for use on an individual field/management unit scale"]
["This section is provided to aid in the organization of calculator results."]
["This section is not used to calculate total points for the field/management unit."]
["Other Landscape Considerations"]
["This section allows the user to indicate if the area downslope (down gradient) from the field/management unit is for 1000 ft or more entirely made up of landscape areas indicated in the provided table."]
["Systems that Capture Runoff and Discharge"]
["This section consolidates the systems that capture runoff and discharge that are included in EPA's Mitigation Menu Website. Some of these systems receive mitigation points, while others fulfill runoff/erosion mitigation requirements on their own (i.e., \"No Additional Runoff/Erosion Mitigation Needed\")."]
["Pesticide Runoff Vulnerability"]
["This section provides two drop down selection cells where users would select the State and County where the field/management unit is located."]
["Conservation Program and Runoff/Erosion Specialists/Mitigation Tracking"]
["This section provides two drop down selection cells where users would indicate if they are tracking their mitigations for the field/management unit (worksheets saved in this calculator or printed and saved would count for this point), and whether they are working with a runoff/erosion specialist or are in a conservation program (see criteria on EPA's mitigation measure website)."]
["Field Characteristics"]
["This section provides EPA's field slope and soil type mitigation measures.  See EPA's mitigation measure website for more details."]
["In-Field Mitigation Measures"]
["This section provides EPA's in-field mitigation measures. The calculator combines subcategories of EPA's mitigation measures (e.g., Reduced Tillage Management) to enable the user to select from drop down menus the applicable condition with their field/managment unit. See EPA's mitigation measure website for more details on these mitigation measures."]
["Field-adjacent Mitigation Measures"]
["This section provides EPA's adjacent to the field mitigation measures. The calculator combines subcategories of EPA's mitigation measures (e.g., Reduced Tillage Management) to enable the user to select from drop down menus the applicable condition with their field/management unit. See EPA's mitigation measure website for more details on these mitigation measures."]
["Other Mitigation Measures"]
["This section auto processes the user inputs in the \"Systems that Capture Runoff and Discharge\", \"In-field Mitigation Measures\", and \"Adjacent to the Field Mitigation Measures\" sections to provide a point if the user indicated measures from two or more of these sections. "]
["Resulting mitigation Points for the Field without application parameters will be Provided in Green Cells"]
["This section provides the results of the calculator and indicates the summation of points the field/management unit based on user inputs. When appropriate, this section will also indicate if the user inputs have resulted in \"No Additional Runoff/Erosion Mitigation Needed\" and states \"Field Meets Runoff/Erosion Mitigation Requirements\".  Note that you are required to comply with the most restrictive requirements across product labels used in the application and any applicable bulletins, which may be achieving a minimum number of runoff/erosion mitigation points (for which you would use this calculator), but could also be other restrictions (e.g., use prohibition, timing restriction, application method prohibition, sandy soil application restriction, subset of menu measures)."]
["Application Parameters"]
["This section considers conditions specific to the application. "]
["Base mitigation points for a field/management unit can be calculated without having this section filled out. This would provide non-application specific calculator results."]
["Resulting Mitigation Points for the Field and Application Parameters will be Provided in Blue Cells"]
["This section provides the results of the calculator and indicates the summation of points the field/management unit plus any mitigation points associated with the application parameters section based on user inputs. When appropriate, this section will also indicate if the user inputs have resulted in \"No Additional Runoff/Erosion Mitigation Needed\" and states \"Field Meets Runoff/Erosion Mitigation Requirements\".  Note that you are required to comply with the most restrictive requirements across product labels used in the application and any applicable bulletins, which may be achieving a minimum number of runoff/erosion mitigation points (for which you would use this calculator), but could also be other restrictions (e.g., use prohibition, timing restriction, application method prohibition, sandy soil application restriction, subset of menu measures)."]

{"sheet":"Runoff Field ID-1","index":1,"n_rows":67,"n_cols":16384,"rows_kept":67,"cut":false,"hidden":false,"merged":[[56,0,56,1],[58,0,58,2],[64,0,64,2],[65,0,65,1],[66,0,66,1],[55,0,55,1],[0,0,0,2],[1,0,1,2],[6,0,6,2],[10,0,10,2],[14,0,14,2],[18,0,18,2],[23,0,23,2],[28,0,28,2],[40,0,40,2],[50,0,50,2],[54,0,54,2]]}
["EPA provides this calculator for informational purposes to assist the user in determining whether the necessary level of mitigation has been met before applying a pesticide product.  Certain mitigation may be required through labeling that directs users to access the mitigation menu website and achieve a certain number of mitigation points. The calculator may also be used as a mitigation tracker.\n\nIn the worksheet below:\n- select from the drop down box or enter value in all cells highlighted in orange (note: a drop down box will show when the user clicks on the relevant cell). Results for the field/management unit are provided in Green shaded cells\n- if additional mitigation may be necessary, results for the pesticide application mitigations and the field/managment unit points are provided in Blue shaded cells. These two sources of mitigation points are summarized to provide the total mitigation points for the field/management unit and the pesticide product application mitigations. \n- click on the Mitigation Measure Title (bolded) to go directly to the mitigation measure description on EPA's Mitigation Menu Website. \n- to duplicate this worksheet for an additional field(s)/management unit(s) use the button \"Create New Worksheet for Another Field/Management Unit\"\n- to clear all user inputs on this worksheet use the button \"Clear all user inputs\".\n\nCAUTION: This calculator will allow the user to input mitigation measures that are logically incompatible (e.g., no till and reservior till). Users are responsible for ensuring that the mitigation measures they input are possible and represent the management used on their field/management unit."]
["General Field/Management Unit Information (Optional Information- Does not Impact Calculation)"]
["Name:"]
["Date:"]
["Field/Management Unit Identification:"]
[]
["Other Landscape Considerations"]
["Category","Select Value","Number of points"]
["Mitigation Relief if the Area at Least 1000 Feet Down-Gradient from the Treated Farm/Field Contains Only Managed Areas.\nManaged areas are defined as:  \na. Agricultural fields, including untreated portions of the treated field,  \nb. Roads, paved or gravel surfaces, mowed grassy areas adjacent to field, and areas of bare ground from recent plowing or grading that are contiguous with the treated area;  \nc. Buildings and their perimeters, silos, or other man-made structures with walls and/or roof;  \nd. Areas maintained as a mitigation measure for runoff/erosion or spray drift control, such as vegetative filter strips (VFS), field borders, hedgerows, Conservation Reserve Program lands (CRP), and other measures on EPA’s Mitigation Menu Website;  \ne. Managed wetlands including constructed wetlands on the farm, and  \nf. On-farm contained irrigation water resources that are not connected to adjacent water bodies, including on-farm irrigation canals and ditches, water conveyances, managed irrigation/runoff retention basins, and tailwater collection ponds.","make selection",{"$f":"IF(B9=\"yes\",\"No Additional Runoff/Erosion Mitigation Needed\",\"Continue Calculating Mitigation Points\")","v":"Continue Calculating Mitigation Points"}]
[]
["Systems that Capture Runoff and Discharge"]
["Category","Select Value","Number of points"]
["Systems that Capture Runoff and Discharge (water retention pond, sediment control basin, irrigation tailwater return system, perimeter berm system (present at the time of application and throughout the cropping season), subsurface or tile drainage with a controlled outlet or without a controlled outlet)","make selection",{"$f":"IF(OR(B13=\"Perimeter Berm System\",B13=\"Irrigation Tailwater Return System\",B13=\"Subsurface or Tile Drainage with Controlled Outlet\"),\"No Additional Runoff/Erosion Mitigation Needed\",IF(OR(B13=\"Water Retention Pond\",B13=\"Sediment Control Basin\"),2,IF(B13=\"Subsurface or Tile Drainage without Controlled Outlet\",1,0)))","v":0}]
[]
["Pesticide Runoff Vulnerability"]
["Select State","Select County","Number of points"]
["make selection","make selection",{"$f":"IFERROR(_xlfn._xlws.FILTER('(locked calculator functions)'!$P2:$P3111,('(locked calculator functions)'!$N2:$N3111=A17)*('(locked calculator functions)'!$O2:$O3111=B17)),\"Select state then county from dropdown menus to the left\")","v":"Select state then county from dropdown menus to the left"}]
[]
["Conservation Program and Runoff/Erosion Specialists/Mitigation Tracking"]
["Category","Select Value","Number of points"]
["Mitigation Tracking","make selection",{"$f":"IF(B21=\"make selection\",0,(IF(B21=\"no\",0,1)))","v":0}]
["Follow Recommendations from a Runoff/Erosion Specialist or Participate in a Qualifying Conservation Program","make selection",{"$f":"IF(B22=\"Working with a runoff/erosion specialist\",1,IF(B22=\"Participating in a qualified conservation program\",2,0))","v":0}]
[]
["Field Characteristics"]
["Category","Select Value","Number of points"]
["Field with Slope <3% (naturally low slope or flat fields; flat laser leveled fields)","make selection",{"$f":"IF(B26=\"yes\",2,0)","v":0}]
["Predominantly Sandy Soils (fields with sand, loamy sand, or sandy loam soil without a restrictive layer that impedes the movement of water through the soil - e.g., \"hard pan\"). This option can only be used if the product label does not prohibit application on sandy soils.","make selection",{"$f":"IF(B27=\"yes\",2,0)","v":0}]
[]
["In-Field Mitigation Measures"]
["Category","Select Value","Number of points"]
["Conservation Tillage (no-till, perennial crop (e.g., orchards that are not tilled), reduced tillage, strip tillage, ridge tillage, mulch tillage)","make selection",{"$f":"IF(OR(B31=\"Reduced Tillage\",B31=\"Strip Till\",B31=\"Mulch Tillage\",B31=\"Ridge Tillage\"),2,(IF(OR(B31=\"Perennial Crop\",B31=\"No Till\"),3,0)))","v":0}]
["Reservoir Tillage (reservoir tillage, furrow diking, basin tillage)","make selection",{"$f":"IF(B32=\"yes\", 3,0)","v":0}]
["Contour Farming (contour farming, contour tillage, contour orchard and perennial crops)","make selection",{"$f":"IF(B33=\"yes\", 2,0)","v":0}]
["Vegetative Strips – In-Field (inter-row vegetated strips, strip cropping or intercropping, alley cropping, prairie strips, contour buffer strips, contour strip cropping, vegetative barrier (occurring in a contoured field))","make selection",{"$f":"IF(B34=\"yes\", 2,0)","v":0}]
["Terrace Farming (terrace farming, terracing, field terracing)","make selection",{"$f":"IF(B35=\"yes\", 2,0)","v":0}]
["Cover Crop or Continuous Ground Cover (cover crop, double cropping, relay cropping)","make selection",{"$f":"IF(B36=\"tillage used to terminate cover crop\", 1,(IF(B36=\"short term cover crop no till\",2,(IF(B36=\"long term cover crop no till\",3,0)))))","v":0}]
["Irrigation Water Management (use of soil moisture sensors/evapotranspiration meters with center pivots & sprinklers; above ground drip tape, drip emitters; micro-sprinklers; use of below tarp irrigation, below ground drip tape; dry farming, non-irrigated lands)","make selection",{"$f":"IF(OR(B37=\"non-irrigated lands\",B37=\"dry farming\",B37=\"below ground drip tape\",B37=\"below tarp irrigation\"),3,(IF(OR(B37=\"drip emitters\",B37=\"above ground drip tape\",B37=\"micro-sprinklers\",B37=\"soil moisture sensors/evapotranspiration meters with center pivots & sprinklers\"),2,0)))","v":0}]
["Mulching with Natural and Artificial Materials (mulching with permeable artificial materials (i.e., landscape fabrics, synthetic mulches), mulching with natural materials)","make selection",{"$f":"IF(B38=\"Mulching with natural materials\",3,IF(B38=\"Mulching with artificial materials\",1,0))","v":0}]
["Erosion Barriers (wattles, silt fences)","make selection",{"$f":"IF(B39=\"yes\", 2,0)","v":0}]
[]
["Field-adjacent Mitigation Measures"]
["Category","Select Value","Number of points"]
["Grassed Waterway","make selection",{"$f":"IF(B43=\"yes\", 2,0)","v":0}]
["Vegetative Filter Strips or Field Border adjacent to field","make selection",{"$f":"IF(B44=\"20 to <30 ft Vegetative filter strip (VFS), field border\",1,IF(B44=\"30 to <60 ft Vegetative filter strip (VFS), field border\",2,IF(B44=\">60 ft Vegetative filter strip (VFS), field border\",3,0)))","v":0}]
["Vegetated Ditch","make selection",{"$f":"IF(B45=\"yes\",1,0)","v":0}]
["Riparian Forest Buffer; Riparian Herbaceous Cover","make selection",{"$f":"IF(B46=\"20 to <30 ft Riparian forest buffer, riparian herbaceous cover\",1,IF(B46=\"30 to <60 ft Riparian forest buffer, riparian herbaceous cover \",2,IF(B46=\">60 ft Riparian forest buffer, riparian herbaceous cover\",3,0)))","v":0}]
["Constructed and Natural Wetlands (constructed and natural wetlands, wetland and riparian landscape/habitat improvement)","make selection",{"$f":"IF(B47=\"yes\", 3,0)","v":0}]
["Terrestrial Habitat Landscape Improvement (critical area planting, cross wind trap strips, hedgerow planting, herbaceous wind barriers, windbreak-shelterbelt establishment and renovation, tree shrub planting, forest stand improvement, upland wildlife habitat management)","make selection",{"$f":"IF(B48=\"20 to <30 ft Terrestrial Landscape/habitat improvement \",1,IF(B48=\"30 to <60 ft Terrestrial Landscape/ habitat improvement\",2,IF(B48=\">60 ft Terrestrial Landscape/ habitat improvement\",3,0)))","v":0}]
["Filtering Devices (filters, sleeves, socks, or filtration units containing activated carbon or compost amendments)","make selection",{"$f":"IF(B49=\"Containing Activated Carbon\",3,IF(B49=\"Containing Compost\",1,0))","v":0}]
[]
["Other Mitigation Measures"]
["Category","Response based on selections above","Number of points"]
["Using mitigation measures from multiple categories (practices from at least two of the following categories: in-field, field-adjacent, or systems that capture runoff and discharge)",{"$f":"IF(OR(AND('Runoff Field ID-1'!XFD56=\"yes\",'Runoff Field ID-1'!XFD57=\"yes\"),AND('Runoff Field ID-1'!XFD56=\"yes\",'Runoff Field ID-1'!XFD58=\"yes\"),AND('Runoff Field ID-1'!XFD57=\"yes\",'Runoff Field ID-1'!XFD58=\"yes\")),\"yes\",\"no\")","v":"no"},{"$f":"IF(B53=\"No\",0,1)","v":0}]
[]
["Resulting Mitigation Points for the Field will be Provided in Green Cells"]
["Does field/management unit need runoff/erosion mitigation?",null,{"$f":"IF(OR(C57>=9,,C13=\"No Additional Runoff/Erosion Mitigation Needed\",C9=\"No Additional Runoff/Erosion Mitigation Needed\"),\"No Additional Runoff/Erosion Mitigation Needed - Field/Management Unit Meets Runoff/Erosion Mitigation Requirements\",\"Compare Total Field/Management Unit Points (Green Cell below) to Label Required Points\")","v":"Compare Total Field/Management Unit Points (Green Cell below) to Label Required Points"},null,null,null,null,null,null,null,null,null,null,null,null,null,null,null,null,null,null,null,null,null,null,null,null,null,null,null,null,null,null,null,null,null,null,null,null,null,null,null,null,null,null,null,null,null,null,null,null,null,null,null,null,null,null,null,null,null,null,null,null,null,null,null,null,null,null,null,null,null,null,null,null,null,null,null,null,null,null,null,null,null,null,null,null,null,null,null,null,null,null,null,null,null,null,null,null,null,null,null,null,null,null,null,null,null,null,null,null,null,null,null,null,null,null,null,null,null,null,null,null,null,null,null,null,null,null,null,null,null,null,null,null,null,null,null,null,null,null,null,null,null,null,null,null,null,null,null,null,null,null,null,null,null,null,null,null,null,null,null,null,null,null,null,null,null,null,null,null,null,null,null,null,null,null,null,null,null,null,null,null,null,null,null,null,null,null,null,null,null,null,null,null,null,null,null,null,null,null,null,null,null,null,null,null,null,null,null,null,null,null,null,null,null,null,null,null,null,null,null,null,null,null,null,null,null,null,null,null,null,null,null,null,null,null,null,null,null,null,null,null,null,null,null,null,null,null,null,null,null,null,null,null,null,null,null,null,null,null,null,null,null,null,null,null,null,null,null,null,null,null,null,null,null,null,null,null,null,null,null,null,null,null,null,null,null,null,null,null,null,null,null,null,null,null,null,null,null,null,null,null,null,null,null,null,null,null,null,null,null,null,null,null,null,null,null,null,null,null,null,null,null,null,null,null,null,null,null,null,null,null,null,null,null,null,null,null,null,null,null,null,null,null,null,null,null,null,null,null,null,null,null,null,null,null,null,null,null,null,null,null,null,null,null,null,null,null,null,null,null,null,null,null,null,null,null,null,null,null,null,null,null,null,null,null,null,null,null,null,null,null,null,null,null,null,null,null,null,null,null,null,null,null,null,null,null,null,null,null,null,null,null,null,null,null,null,null,null,null,null,null,null,null,null,null,null,null,null,null,null,null,null,null,null,null,null,null,null,null,null,null,null,null,null,null,null,null,null,null,null,null,null,null,null,null,null,null,null,null,null,null,null,null,null,null,null,null,null,null,null,null,null,null,null,null,null,null,null,null,null,null,null,null,null,null,null,null,null,null,null,null,null,null,null,null,null,null,null,null,null,null,null,null,null,null,null,null,null,null,null,null,null,null,null,null,null,null,null,null,null,null,null,null,null,null,null,null,null,null,null,null,null,null,null,null,null,null,null,null,null,null,null,null,null,null,null,null,null,null,null,null,null,null,null,null,null,null,null,null,null,null,null,null,null,null,null,null,null,null,null,null,null,null,null,null,null,null,null,null,null,null,null,null,null,null,null,null,null,null,null,null,null,null,null,null,null,null,null,null,null,null,null,null,null,null,null,null,null,null,null,null,null,null,null,null,null,null,null,null,null,null,null,null,null,null,null,null,null,null,null,null,null,null,null,null,null,null,null,null,null,null,null,null,null,null,null,null,null,null,null,null,null,null,null,null,null,null,null,null,null,null,null,null,null,null,null,null,null,null,null,null,null,null,null,null,null,null,null,null,null,null,null,null,null,null,null,null,null,null,null,null,null,null,null,null,null,null,null,null,null,null,null,null,null,null,null,null,null,null,null,null,null,null,null,null,null,null,null,null,null,null,null,null,null,null,null,null,null,null,null,null,null,null,null,null,null,null,null,null,null,null,null,null,null,null,null,null,null,null,null,null,null,null,null,null,null,null,null,null,null,null,null,null,null,null,null,null,null,null,null,null,null,null,null,null,null,null,null,null,null,null,null,null,null,null,null,null,null,null,null,null,null,null,null,null,null,null,null,null,null,null,null,null,null,null,null,null,null,null,null,null,null,null,null,null,null,null,null,null,null,null,null,null,null,null,null,null,null,null,null,null,null,null,null,null,null,null,null,null,null,null,null,null,null,null,null,null,null,null,null,null,null,null,null,null,null,null,null,null,null,null,null,null,null,null,null,null,null,null,null,null,null,null,null,null,null,null,null,null,null,null,null,null,null,null,null,null,null,null,null,null,null,null,null,null,null,null,null,null,null,null,null,null,null,null,null,null,null,null,null,null,null,null,null,null,null,null,null,null,null,null,null,null,null,null,null,null,null,null,null,null,null,null,null,null,null,null,null,null,null,null,null,null,null,null,null,null,null,null,null,null,null,null,null,null,null,null,null,null,null,null,null,null,null,null,null,null,null,null,null,null,null,null,null,null,null,null,null,null,null,null,null,null,null,null,null,null,null,null,null,null,null,null,null,null,null,null,null,null,null,null,null,null,null,null,null,null,null,null,null,null,null,null,null,null,null,null,null,null,null,null,null,null,null,null,null,null,null,null,null,null,null,null,null,null,null,null,null,null,null,null,null,null,null,null,null,null,null,null,null,null,null,null,null,null,null,null,null,null,null,null,null,null,null,null,null,null,null,null,null,null,null,null,null,null,null,null,null,null,null,null,null,null,null,null,null,null,null,null,null,null,null,null,null,null,null,null,null,null,null,null,null,null,null,null,null,null,null,null,null,null,null,null,null,null,null,null,null,null,null,null,null,null,null,null,null,null,null,null,null,null,null,null,null,null,null,null,null,null,null,null,null,null,null,null,null,null,null,null,null,null,null,null,null,null,null,null,null,null,null,null,null,null,null,null,null,null,null,null,null,null,null,null,null,null,null,null,null,null,null,null,null,null,null,null,null,null,null,null,null,null,null,null,null,null,null,null,null,null,null,null,null,null,null,null,null,null,null,null,null,null,null,null,null,null,null,null,null,null,null,null,null,null,null,null,null,null,null,null,null,null,null,null,null,null,null,null,null,null,null,null,null,null,null,null,null,null,null,null,null,null,null,null,null,null,null,null,null,null,null,null,null,null,null,null,null,null,null,null,null,null,null,null,null,null,null,null,null,null,null,null,null,null,null,null,null,null,null,null,null,null,null,null,null,null,null,null,null,null,null,null,null,null,null,null,null,null,null,null,null,null,null,null,null,null,null,null,null,null,null,null,null,null,null,null,null,null,null,null,null,null,null,null,null,null,null,null,null,null,null,null,null,null,null,null,null,null,null,null,null,null,null,null,null,null,null,null,null,null,null,null,null,null,null,null,null,null,null,null,null,null,null,null,null,null,null,null,null,null,null,null,null,null,null,null,null,null,null,null,null,null,null,null,null,null,null,null,null,null,null,null,null,null,null,null,null,null,null,null,null,null,null,null,null,null,null,null,null,null,null,null,null,null,null,null,null,null,null,null,null,null,null,null,null,null,null,null,null,null,null,null,null,null,null,null,null,null,null,null,null,null,null,null,null,null,null,null,null,null,null,null,null,null,null,null,null,null,null,null,null,null,null,null,null,null,null,null,null,null,null,null,null,null,null,null,null,null,null,null,null,null,null,null,null,null,null,null,null,null,null,null,null,null,null,null,null,null,null,null,null,null,null,null,null,null,null,null,null,null,null,null,null,null,null,null,null,null,null,null,null,null,null,null,null,null,null,null,null,null,null,null,null,null,null,null,null,null,null,null,null,null,null,null,null,null,null,null,null,null,null,null,null,null,null,null,null,null,null,null,null,null,null,null,null,null,null,null,null,null,null,null,null,null,null,null,null,null,null,null,null,null,null,null,null,null,null,null,null,null,null,null,null,null,null,null,null,null,null,null,null,null,null,null,null,null,null,null,null,null,null,null,null,null,null,null,null,null,null,null,null,null,null,null,null,null,null,null,null,null,null,null,null,null,null,null,null,null,null,null,null,null,null,null,null,null,null,null,null,null,null,null,null,null,null,null,null,null,null,null,null,null,null,null,null,null,null,null,null,null,null,null,null,null,null,null,null,null,null,null,null,null,null,null,null,null,null,null,null,null,null,null,null,null,null,null,null,null,null,null,null,null,null,null,null,null,null,null,null,null,null,null,null,null,null,null,null,null,null,null,null,null,null,null,null,null,null,null,null,null,null,null,null,null,null,null,null,null,null,null,null,null,null,null,null,null,null,null,null,null,null,null,null,null,null,null,null,null,null,null,null,null,null,null,null,null,null,null,null,null,null,null,null,null,null,null,null,null,null,null,null,null,null,null,null,null,null,null,null,null,null,null,null,null,null,null,null,null,null,null,null,null,null,null,null,null,null,null,null,null,null,null,null,null,null,null,null,null,null,null,null,null,null,null,null,null,null,null,null,null,null,null,null,null,null,null,null,null,null,null,null,null,null,null,null,null,null,null,null,null,null,null,null,null,null,null,null,null,null,null,null,null,null,null,null,null,null,null,null,null,null,null,null,null,null,null,null,null,null,null,null,null,null,null,null,null,null,null,null,null,null,null,null,null,null,null,null,null,null,null,null,null,null,null,null,null,null,null,null,null,null,null,null,null,null,null,null,null,null,null,null,null,null,null,null,null,null,null,null,null,null,null,null,null,null,null,null,null,null,null,null,null,null,null,null,null,null,null,null,null,null,null,null,null,null,null,null,null,null,null,null,null,null,null,null,null,null,null,null,null,null,null,null,null,null,null,null,null,null,null,null,null,null,null,null,null,null,null,null,null,null,null,null,null,null,null,null,null,null,null,null,null,null,null,null,null,null,null,null,null,null,null,null,null,null,null,null,null,null,null,null,null,null,null,null,null,null,null,null,null,null,null,null,null,null,null,null,null,null,null,null,null,null,null,null,null,null,null,null,null,null,null,null,null,null,null,null,null,null,null,null,null,null,null,null,null,null,null,null,null,null,null,null,null,null,null,null,null,null,null,null,null,null,null,null,null,null,null,null,null,null,null,null,null,null,null,null,null,null,null,null,null,null,null,null,null,null,null,null,null,null,null,null,null,null,null,null,null,null,null,null,null,null,null,null,null,null,null,null,null,null,null,null,null,null,null,null,null,null,null,null,null,null,null,null,null,null,null,null,null,null,null,null,null,null,null,null,null,null,null,null,null,null,null,null,null,null,null,null,null,null,null,null,null,null,null,null,null,null,null,null,null,null,null,null,null,null,null,null,null,null,null,null,null,null,null,null,null,null,null,null,null,null,null,null,null,null,null,null,null,null,null,null,null,null,null,null,null,null,null,null,null,null,null,null,null,null,null,null,null,null,null,null,null,null,null,null,null,null,null,null,null,null,null,null,null,null,null,null,null,null,null,null,null,null,null,null,null,null,null,null,null,null,null,null,null,null,null,null,null,null,null,null,null,null,null,null,null,null,null,null,null,null,null,null,null,null,null,null,null,null,null,null,null,null,null,null,null,null,null,null,null,null,null,null,null,null,null,null,null,null,null,null,null,null,null,null,null,null,null,null,null,null,null,null,null,null,null,null,null,null,null,null,null,null,null,null,null,null,null,null,null,null,null,null,null,null,null,null,null,null,null,null,null,null,null,null,null,null,null,null,null,null,null,null,null,null,null,null,null,null,null,null,null,null,null,null,null,null,null,null,null,null,null,null,null,null,null,null,null,null,null,null,null,null,null,null,null,null,null,null,null,null,null,null,null,null,null,null,null,null,null,null,null,null,null,null,null,null,null,null,null,null,null,null,null,null,null,null,null,null,null,null,null,null,null,null,null,null,null,null,null,null,null,null,null,null,null,null,null,null,null,null,null,null,null,null,null,null,null,null,null,null,null,null,null,null,null,null,null,null,null,null,null,null,null,null,null,null,null,null,null,null,null,null,null,null,null,null,null,null,null,null,null,null,null,null,null,null,null,null,null,null,null,null,null,null,null,null,null,null,null,null,null,null,null,null,null,null,null,null,null,null,null,null,null,null,null,null,null,null,null,null,null,null,null,null,null,null,null,null,null,null,null,null,null,null,null,null,null,null,null,null,null,null,null,null,null,null,null,null,null,null,null,null,null,null,null,null,null,null,null,null,null,null,null,null,null,null,null,null,null,null,null,null,null,null,null,null,null,null,null,null,null,null,null,null,null,null,null,null,null,null,null,null,null,null,null,null,null,null,null,null,null,null,null,null,null,null,null,null,null,null,null,null,null,null,null,null,null,null,null,null,null,null,null,null,null,null,null,null,null,null,null,null,null,null,null,null,null,null,null,null,null,null,null,null,null,null,null,null,null,null,null,null,null,null,null,null,null,null,null,null,null,null,null,null,null,null,null,null,null,null,null,null,null,null,null,null,null,null,null,null,null,null,null,null,null,null,null,null,null,null,null,null,null,null,null,null,null,null,null,null,null,null,null,null,null,null,null,null,null,null,null,null,null,null,null,null,null,null,null,null,null,null,null,null,null,null,null,null,null,null,null,null,null,null,null,null,null,null,null,null,null,null,null,null,null,null,null,null,null,null,null,null,null,null,null,null,null,null,null,null,null,null,null,null,null,null,null,null,null,null,null,null,null,null,null,null,null,null,null,null,null,null,null,null,null,null,null,null,null,null,null,null,null,null,null,null,null,null,null,null,null,null,null,null,null,null,null,null,null,null,null,null,null,null,null,null,null,null,null,null,null,null,null,null,null,null,null,null,null,null,null,null,null,null,null,null,null,null,null,null,null,null,null,null,null,null,null,null,null,null,null,null,null,null,null,null,null,null,null,null,null,null,null,null,null,null,null,null,null,null,null,null,null,null,null,null,null,null,null,null,null,null,null,null,null,null,null,null,null,null,null,null,null,null,null,null,null,null,null,null,null,null,null,null,null,null,null,null,null,null,null,null,null,null,null,null,null,null,null,null,null,null,null,null,null,null,null,null,null,null,null,null,null,null,null,null,null,null,null,null,null,null,null,null,null,null,null,null,null,null,null,null,null,null,null,null,null,null,null,null,null,null,null,null,null,null,null,null,null,null,null,null,null,null,null,null,null,null,null,null,null,null,null,null,null,null,null,null,null,null,null,null,null,null,null,null,null,null,null,null,null,null,null,null,null,null,null,null,null,null,null,null,null,null,null,null,null,null,null,null,null,null,null,null,null,null,null,null,null,null,null,null,null,null,null,null,null,null,null,null,null,null,null,null,null,null,null,null,null,null,null,null,null,null,null,null,null,null,null,null,null,null,null,null,null,null,null,null,null,null,null,null,null,null,null,null,null,null,null,null,null,null,null,null,null,null,null,null,null,null,null,null,null,null,null,null,null,null,null,null,null,null,null,null,null,null,null,null,null,null,null,null,null,null,null,null,null,null,null,null,null,null,null,null,null,null,null,null,null,null,null,null,null,null,null,null,null,null,null,null,null,null,null,null,null,null,null,null,null,null,null,null,null,null,null,null,null,null,null,null,null,null,null,null,null,null,null,null,null,null,null,null,null,null,null,null,null,null,null,null,null,null,null,null,null,null,null,null,null,null,null,null,null,null,null,null,null,null,null,null,null,null,null,null,null,null,null,null,null,null,null,null,null,null,null,null,null,null,null,null,null,null,null,null,null,null,null,null,null,null,null,null,null,null,null,null,null,null,null,null,null,null,null,null,null,null,null,null,null,null,null,null,null,null,null,null,null,null,null,null,null,null,null,null,null,null,null,null,null,null,null,null,null,null,null,null,null,null,null,null,null,null,null,null,null,null,null,null,null,null,null,null,null,null,null,null,null,null,null,null,null,null,null,null,null,null,null,null,null,null,null,null,null,null,null,null,null,null,null,null,null,null,null,null,null,null,null,null,null,null,null,null,null,null,null,null,null,null,null,null,null,null,null,null,null,null,null,null,null,null,null,null,null,null,null,null,null,null,null,null,null,null,null,null,null,null,null,null,null,null,null,null,null,null,null,null,null,null,null,null,null,null,null,null,null,null,null,null,null,null,null,null,null,null,null,null,null,null,null,null,null,null,null,null,null,null,null,null,null,null,null,null,null,null,null,null,null,null,null,null,null,null,null,null,null,null,null,null,null,null,null,null,null,null,null,null,null,null,null,null,null,null,null,null,null,null,null,null,null,null,null,null,null,null,null,null,null,null,null,null,null,null,null,null,null,null,null,null,null,null,null,null,null,null,null,null,null,null,null,null,null,null,null,null,null,null,null,null,null,null,null,null,null,null,null,null,null,null,null,null,null,null,null,null,null,null,null,null,null,null,null,null,null,null,null,null,null,null,null,null,null,null,null,null,null,null,null,null,null,null,null,null,null,null,null,null,null,null,null,null,null,null,null,null,null,null,null,null,null,null,null,null,null,null,null,null,null,null,null,null,null,null,null,null,null,null,null,null,null,null,null,null,null,null,null,null,null,null,null,null,null,null,null,null,null,null,null,null,null,null,null,null,null,null,null,null,null,null,null,null,null,null,null,null,null,null,null,null,null,null,null,null,null,null,null,null,null,null,null,null,null,null,null,null,null,null,null,null,null,null,null,null,null,null,null,null,null,null,null,null,null,null,null,null,null,null,null,null,null,null,null,null,null,null,null,null,null,null,null,null,null,null,null,null,null,null,null,null,null,null,null,null,null,null,null,null,null,null,null,null,null,null,null,null,null,null,null,null,null,null,null,null,null,null,null,null,null,null,null,null,null,null,null,null,null,null,null,null,null,null,null,null,null,null,null,null,null,null,null,null,null,null,null,null,null,null,null,null,null,null,null,null,null,null,null,null,null,null,null,null,null,null,null,null,null,null,null,null,null,null,null,null,null,null,null,null,null,null,null,null,null,null,null,null,null,null,null,null,null,null,null,null,null,null,null,null,null,null,null,null,null,null,null,null,null,null,null,null,null,null,null,null,null,null,null,null,null,null,null,null,null,null,null,null,null,null,null,null,null,null,null,null,null,null,null,null,null,null,null,null,null,null,null,null,null,null,null,null,null,null,null,null,null,null,null,null,null,null,null,null,null,null,null,null,null,null,null,null,null,null,null,null,null,null,null,null,null,null,null,null,null,null,null,null,null,null,null,null,null,null,null,null,null,null,null,null,null,null,null,null,null,null,null,null,null,null,null,null,null,null,null,null,null,null,null,null,null,null,null,null,null,null,null,null,null,null,null,null,null,null,null,null,null,null,null,null,null,null,null,null,null,null,null,null,null,null,null,null,null,null,null,null,null,null,null,null,null,null,null,null,null,null,null,null,null,null,null,null,null,null,null,null,null,null,null,null,null,null,null,null,null,null,null,null,null,null,null,null,null,null,null,null,null,null,null,null,null,null,null,null,null,null,null,null,null,null,null,null,null,null,null,null,null,null,null,null,null,null,null,null,null,null,null,null,null,null,null,null,null,null,null,null,null,null,null,null,null,null,null,null,null,null,null,null,null,null,null,null,null,null,null,null,null,null,null,null,null,null,null,null,null,null,null,null,null,null,null,null,null,null,null,null,null,null,null,null,null,null,null,null,null,null,null,null,null,null,null,null,null,null,null,null,null,null,null,null,null,null,null,null,null,null,null,null,null,null,null,null,null,null,null,null,null,null,null,null,null,null,null,null,null,null,null,null,null,null,null,null,null,null,null,null,null,null,null,null,null,null,null,null,null,null,null,null,null,null,null,null,null,null,null,null,null,null,null,null,null,null,null,null,null,null,null,null,null,null,null,null,null,null,null,null,null,null,null,null,null,null,null,null,null,null,null,null,null,null,null,null,null,null,null,null,null,null,null,null,null,null,null,null,null,null,null,null,null,null,null,null,null,null,null,null,null,null,null,null,null,null,null,null,null,null,null,null,null,null,null,null,null,null,null,null,null,null,null,null,null,null,null,null,null,null,null,null,null,null,null,null,null,null,null,null,null,null,null,null,null,null,null,null,null,null,null,null,null,null,null,null,null,null,null,null,null,null,null,null,null,null,null,null,null,null,null,null,null,null,null,null,null,null,null,null,null,null,null,null,null,null,null,null,null,null,null,null,null,null,null,null,null,null,null,null,null,null,null,null,null,null,null,null,null,null,null,null,null,null,null,null,null,null,null,null,null,null,null,null,null,null,null,null,null,null,null,null,null,null,null,null,null,null,null,null,null,null,null,null,null,null,null,null,null,null,null,null,null,null,null,null,null,null,null,null,null,null,null,null,null,null,null,null,null,null,null,null,null,null,null,null,null,null,null,null,null,null,null,null,null,null,null,null,null,null,null,null,null,null,null,null,null,null,null,null,null,null,null,null,null,null,null,null,null,null,null,null,null,null,null,null,null,null,null,null,null,null,null,null,null,null,null,null,null,null,null,null,null,null,null,null,null,null,null,null,null,null,null,null,null,null,null,null,null,null,null,null,null,null,null,null,null,null,null,null,null,null,null,null,null,null,null,null,null,null,null,null,null,null,null,null,null,null,null,null,null,null,null,null,null,null,null,null,null,null,null,null,null,null,null,null,null,null,null,null,null,null,null,null,null,null,null,null,null,null,null,null,null,null,null,null,null,null,null,null,null,null,null,null,null,null,null,null,null,null,null,null,null,null,null,null,null,null,null,null,null,null,null,null,null,null,null,null,null,null,null,null,null,null,null,null,null,null,null,null,null,null,null,null,null,null,null,null,null,null,null,null,null,null,null,null,null,null,null,null,null,null,null,null,null,null,null,null,null,null,null,null,null,null,null,null,null,null,null,null,null,null,null,null,null,null,null,null,null,null,null,null,null,null,null,null,null,null,null,null,null,null,null,null,null,null,null,null,null,null,null,null,null,null,null,null,null,null,null,null,null,null,null,null,null,null,null,null,null,null,null,null,null,null,null,null,null,null,null,null,null,null,null,null,null,null,null,null,null,null,null,null,null,null,null,null,null,null,null,null,null,null,null,null,null,null,null,null,null,null,null,null,null,null,null,null,null,null,null,null,null,null,null,null,null,null,null,null,null,null,null,null,null,null,null,null,null,null,null,null,null,null,null,null,null,null,null,null,null,null,null,null,null,null,null,null,null,null,null,null,null,null,null,null,null,null,null,null,null,null,null,null,null,null,null,null,null,null,null,null,null,null,null,null,null,null,null,null,null,null,null,null,null,null,null,null,null,null,null,null,null,null,null,null,null,null,null,null,null,null,null,null,null,null,null,null,null,null,null,null,null,null,null,null,null,null,null,null,null,null,null,null,null,null,null,null,null,null,null,null,null,null,null,null,null,null,null,null,null,null,null,null,null,null,null,null,null,null,null,null,null,null,null,null,null,null,null,null,null,null,null,null,null,null,null,null,null,null,null,null,null,null,null,null,null,null,null,null,null,null,null,null,null,null,null,null,null,null,null,null,null,null,null,null,null,null,null,null,null,null,null,null,null,null,null,null,null,null,null,null,null,null,null,null,null,null,null,null,null,null,null,null,null,null,null,null,null,null,null,null,null,null,null,null,null,null,null,null,null,null,null,null,null,null,null,null,null,null,null,null,null,null,null,null,null,null,null,null,null,null,null,null,null,null,null,null,null,null,null,null,null,null,null,null,null,null,null,null,null,null,null,null,null,null,null,null,null,null,null,null,null,null,null,null,null,null,null,null,null,null,null,null,null,null,null,null,null,null,null,null,null,null,null,null,null,null,null,null,null,null,null,null,null,null,null,null,null,null,null,null,null,null,null,null,null,null,null,null,null,null,null,null,null,null,null,null,null,null,null,null,null,null,null,null,null,null,null,null,null,null,null,null,null,null,null,null,null,null,null,null,null,null,null,null,null,null,null,null,null,null,null,null,null,null,null,null,null,null,null,null,null,null,null,null,null,null,null,null,null,null,null,null,null,null,null,null,null,null,null,null,null,null,null,null,null,null,null,null,null,null,null,null,null,null,null,null,null,null,null,null,null,null,null,null,null,null,null,null,null,null,null,null,null,null,null,null,null,null,null,null,null,null,null,null,null,null,null,null,null,null,null,null,null,null,null,null,null,null,null,null,null,null,null,null,null,null,null,null,null,null,null,null,null,null,null,null,null,null,null,null,null,null,null,null,null,null,null,null,null,null,null,null,null,null,null,null,null,null,null,null,null,null,null,null,null,null,null,null,null,null,null,null,null,null,null,null,null,null,null,null,null,null,null,null,null,null,null,null,null,null,null,null,null,null,null,null,null,null,null,null,null,null,null,null,null,null,null,null,null,null,null,null,null,null,null,null,null,null,null,null,null,null,null,null,null,null,null,null,null,null,null,null,null,null,null,null,null,null,null,null,null,null,null,null,null,null,null,null,null,null,null,null,null,null,null,null,null,null,null,null,null,null,null,null,null,null,null,null,null,null,null,null,null,null,null,null,null,null,null,null,null,null,null,null,null,null,null,null,null,null,null,null,null,null,null,null,null,null,null,null,null,null,null,null,null,null,null,null,null,null,null,null,null,null,null,null,null,null,null,null,null,null,null,null,null,null,null,null,null,null,null,null,null,null,null,null,null,null,null,null,null,null,null,null,null,null,null,null,null,null,null,null,null,null,null,null,null,null,null,null,null,null,null,null,null,null,null,null,null,null,null,null,null,null,null,null,null,null,null,null,null,null,null,null,null,null,null,null,null,null,null,null,null,null,null,null,null,null,null,null,null,null,null,null,null,null,null,null,null,null,null,null,null,null,null,null,null,null,null,null,null,null,null,null,null,null,null,null,null,null,null,null,null,null,null,null,null,null,null,null,null,null,null,null,null,null,null,null,null,null,null,null,null,null,null,null,null,null,null,null,null,null,null,null,null,null,null,null,null,null,null,null,null,null,null,null,null,null,null,null,null,null,null,null,null,null,null,null,null,null,null,null,null,null,null,null,null,null,null,null,null,null,null,null,null,null,null,null,null,null,null,null,null,null,null,null,null,null,null,null,null,null,null,null,null,null,null,null,null,null,null,null,null,null,null,null,null,null,null,null,null,null,null,null,null,null,null,null,null,null,null,null,null,null,null,null,null,null,null,null,null,null,null,null,null,null,null,null,null,null,null,null,null,null,null,null,null,null,null,null,null,null,null,null,null,null,null,null,null,null,null,null,null,null,null,null,null,null,null,null,null,null,null,null,null,null,null,null,null,null,null,null,null,null,null,null,null,null,null,null,null,null,null,null,null,null,null,null,null,null,null,null,null,null,null,null,null,null,null,null,null,null,null,null,null,null,null,null,null,null,null,null,null,null,null,null,null,null,null,null,null,null,null,null,null,null,null,null,null,null,null,null,null,null,null,null,null,null,null,null,null,null,null,null,null,null,null,null,null,null,null,null,null,null,null,null,null,null,null,null,null,null,null,null,null,null,null,null,null,null,null,null,null,null,null,null,null,null,null,null,null,null,null,null,null,null,null,null,null,null,null,null,null,null,null,null,null,null,null,null,null,null,null,null,null,null,null,null,null,null,null,null,null,null,null,null,null,null,null,null,null,null,null,null,null,null,null,null,null,null,null,null,null,null,null,null,null,null,null,null,null,null,null,null,null,null,null,null,null,null,null,null,null,null,null,null,null,null,null,null,null,null,null,null,null,null,null,null,null,null,null,null,null,null,null,null,null,null,null,null,null,null,null,null,null,null,null,null,null,null,null,null,null,null,null,null,null,null,null,null,null,null,null,null,null,null,null,null,null,null,null,null,null,null,null,null,null,null,null,null,null,null,null,null,null,null,null,null,null,null,null,null,null,null,null,null,null,null,null,null,null,null,null,null,null,null,null,null,null,null,null,null,null,null,null,null,null,null,null,null,null,null,null,null,null,null,null,null,null,null,null,null,null,null,null,null,null,null,null,null,null,null,null,null,null,null,null,null,null,null,null,null,null,null,null,null,null,null,null,null,null,null,null,null,null,null,null,null,null,null,null,null,null,null,null,null,null,null,null,null,null,null,null,null,null,null,null,null,null,null,null,null,null,null,null,null,null,null,null,null,null,null,null,null,null,null,null,null,null,null,null,null,null,null,null,null,null,null,null,null,null,null,null,null,null,null,null,null,null,null,null,null,null,null,null,null,null,null,null,null,null,null,null,null,null,null,null,null,null,null,null,null,null,null,null,null,null,null,null,null,null,null,null,null,null,null,null,null,null,null,null,null,null,null,null,null,null,null,null,null,null,null,null,null,null,null,null,null,null,null,null,null,null,null,null,null,null,null,null,null,null,null,null,null,null,null,null,null,null,null,null,null,null,null,null,null,null,null,null,null,null,null,null,null,null,null,null,null,null,null,null,null,null,null,null,null,null,null,null,null,null,null,null,null,null,null,null,null,null,null,null,null,null,null,null,null,null,null,null,null,null,null,null,null,null,null,null,null,null,null,null,null,null,null,null,null,null,null,null,null,null,null,null,null,null,null,null,null,null,null,null,null,null,null,null,null,null,null,null,null,null,null,null,null,null,null,null,null,null,null,null,null,null,null,null,null,null,null,null,null,null,null,null,null,null,null,null,null,null,null,null,null,null,null,null,null,null,null,null,null,null,null,null,null,null,null,null,null,null,null,null,null,null,null,null,null,null,null,null,null,null,null,null,null,null,null,null,null,null,null,null,null,null,null,null,null,null,null,null,null,null,null,null,null,null,null,null,null,null,null,null,null,null,null,null,null,null,null,null,null,null,null,null,null,null,null,null,null,null,null,null,null,null,null,null,null,null,null,null,null,null,null,null,null,null,null,null,null,null,null,null,null,null,null,null,null,null,null,null,null,null,null,null,null,null,null,null,null,null,null,null,null,null,null,null,null,null,null,null,null,null,null,null,null,null,null,null,null,null,null,null,null,null,null,null,null,null,null,null,null,null,null,null,null,null,null,null,null,null,null,null,null,null,null,null,null,null,null,null,null,null,null,null,null,null,null,null,null,null,null,null,null,null,null,null,null,null,null,null,null,null,null,null,null,null,null,null,null,null,null,null,null,null,null,null,null,null,null,null,null,null,null,null,null,null,null,null,null,null,null,null,null,null,null,null,null,null,null,null,null,null,null,null,null,null,null,null,null,null,null,null,null,null,null,null,null,null,null,null,null,null,null,null,null,null,null,null,null,null,null,null,null,null,null,null,null,null,null,null,null,null,null,null,null,null,null,null,null,null,null,null,null,null,null,null,null,null,null,null,null,null,null,null,null,null,null,null,null,null,null,null,null,null,null,null,null,null,null,null,null,null,null,null,null,null,null,null,null,null,null,null,null,null,null,null,null,null,null,null,null,null,null,null,null,null,null,null,null,null,null,null,null,null,null,null,null,null,null,null,null,null,null,null,null,null,null,null,null,null,null,null,null,null,null,null,null,null,null,null,null,null,null,null,null,null,null,null,null,null,null,null,null,null,null,null,null,null,null,null,null,null,null,null,null,null,null,null,null,null,null,null,null,null,null,null,null,null,null,null,null,null,null,null,null,null,null,null,null,null,null,null,null,null,null,null,null,null,null,null,null,null,null,null,null,null,null,null,null,null,null,null,null,null,null,null,null,null,null,null,null,null,null,null,null,null,null,null,null,null,null,null,null,null,null,null,null,null,null,null,null,null,null,null,null,null,null,null,null,null,null,null,null,null,null,null,null,null,null,null,null,null,null,null,null,null,null,null,null,null,null,null,null,null,null,null,null,null,null,null,null,null,null,null,null,null,null,null,null,null,null,null,null,null,null,null,null,null,null,null,null,null,null,null,null,null,null,null,null,null,null,null,null,null,null,null,null,null,null,null,null,null,null,null,null,null,null,null,null,null,null,null,null,null,null,null,null,null,null,null,null,null,null,null,null,null,null,null,null,null,null,null,null,null,null,null,null,null,null,null,null,null,null,null,null,null,null,null,null,null,null,null,null,null,null,null,null,null,null,null,null,null,null,null,null,null,null,null,null,null,null,null,null,null,null,null,null,null,null,null,null,null,null,null,null,null,null,null,null,null,null,null,null,null,null,null,null,null,null,null,null,null,null,null,null,null,null,null,null,null,null,null,null,null,null,null,null,null,null,null,null,null,null,null,null,null,null,null,null,null,null,null,null,null,null,null,null,null,null,null,null,null,null,null,null,null,null,null,null,null,null,null,null,null,null,null,null,null,null,null,null,null,null,null,null,null,null,null,null,null,null,null,null,null,null,null,null,null,null,null,null,null,null,null,null,null,null,null,null,null,null,null,null,null,null,null,null,null,null,null,null,null,null,null,null,null,null,null,null,null,null,null,null,null,null,null,null,null,null,null,null,null,null,null,null,null,null,null,null,null,null,null,null,null,null,null,null,null,null,null,null,null,null,null,null,null,null,null,null,null,null,null,null,null,null,null,null,null,null,null,null,null,null,null,null,null,null,null,null,null,null,null,null,null,null,null,null,null,null,null,null,null,null,null,null,null,null,null,null,null,null,null,null,null,null,null,null,null,null,null,null,null,null,null,null,null,null,null,null,null,null,null,null,null,null,null,null,null,null,null,null,null,null,null,null,null,null,null,null,null,null,null,null,null,null,null,null,null,null,null,null,null,null,null,null,null,null,null,null,null,null,null,null,null,null,null,null,null,null,null,null,null,null,null,null,null,null,null,null,null,null,null,null,null,null,null,null,null,null,null,null,null,null,null,null,null,null,null,null,null,null,null,null,null,null,null,null,null,null,null,null,null,null,null,null,null,null,null,null,null,null,null,null,null,null,null,null,null,null,null,null,null,null,null,null,null,null,null,null,null,null,null,null,null,null,null,null,null,null,null,null,null,null,null,null,null,null,null,null,null,null,null,null,null,null,null,null,null,null,null,null,null,null,null,null,null,null,null,null,null,null,null,null,null,null,null,null,null,null,null,null,null,null,null,null,null,null,null,null,null,null,null,null,null,null,null,null,null,null,null,null,null,null,null,null,null,null,null,null,null,null,null,null,null,null,null,null,null,null,null,null,null,null,null,null,null,null,null,null,null,null,null,null,null,null,null,null,null,null,null,null,null,null,null,null,null,null,null,null,null,null,null,null,null,null,null,null,null,null,null,null,null,null,null,null,null,null,null,null,null,null,null,null,null,null,null,null,null,null,null,null,null,null,null,null,null,null,null,null,null,null,null,null,null,null,null,null,null,null,null,null,null,null,null,null,null,null,null,null,null,null,null,null,null,null,null,null,null,null,null,null,null,null,null,null,null,null,null,null,null,null,null,null,null,null,null,null,null,null,null,null,null,null,null,null,null,null,null,null,null,null,null,null,null,null,null,null,null,null,null,null,null,null,null,null,null,null,null,null,null,null,null,null,null,null,null,null,null,null,null,null,null,null,null,null,null,null,null,null,null,null,null,null,null,null,null,null,null,null,null,null,null,null,null,null,null,null,null,null,null,null,null,null,null,null,null,null,null,null,null,null,null,null,null,null,null,null,null,null,null,null,null,null,null,null,null,null,null,null,null,null,null,null,null,null,null,null,null,null,null,null,null,null,null,null,null,null,null,null,null,null,null,null,null,null,null,null,null,null,null,null,null,null,null,null,null,null,null,null,null,null,null,null,null,null,null,null,null,null,null,null,null,null,null,null,null,null,null,null,null,null,null,null,null,null,null,null,null,null,null,null,null,null,null,null,null,null,null,null,null,null,null,null,null,null,null,null,null,null,null,null,null,null,null,null,null,null,null,null,null,null,null,null,null,null,null,null,null,null,null,null,null,null,null,null,null,null,null,null,null,null,null,null,null,null,null,null,null,null,null,null,null,null,null,null,null,null,null,null,null,null,null,null,null,null,null,null,null,null,null,null,null,null,null,null,null,null,null,null,null,null,null,null,null,null,null,null,null,null,null,null,null,null,null,null,null,null,null,null,null,null,null,null,null,null,null,null,null,null,null,null,null,null,null,null,null,null,null,null,null,null,null,null,null,null,null,null,null,null,null,null,null,null,null,null,null,null,null,null,null,null,null,null,null,null,null,null,null,null,null,null,null,null,null,null,null,null,null,null,null,null,null,null,null,null,null,null,null,null,null,null,null,null,null,null,null,null,null,null,null,null,null,null,null,null,null,null,null,null,null,null,null,null,null,null,null,null,null,null,null,null,null,null,null,null,null,null,null,null,null,null,null,null,null,null,null,null,null,null,null,null,null,null,null,null,null,null,null,null,null,null,null,null,null,null,null,null,null,null,null,null,null,null,null,null,null,null,null,null,null,null,null,null,null,null,null,null,null,null,null,null,null,null,null,null,null,null,null,null,null,null,null,null,null,null,null,null,null,null,null,null,null,null,null,null,null,null,null,null,null,null,null,null,null,null,null,null,null,null,null,null,null,null,null,null,null,null,null,null,null,null,null,null,null,null,null,null,null,null,null,null,null,null,null,null,null,null,null,null,null,null,null,null,null,null,null,null,null,null,null,null,null,null,null,null,null,null,null,null,null,null,null,null,null,null,null,null,null,null,null,null,null,null,null,null,null,null,null,null,null,null,null,null,null,null,null,null,null,null,null,null,null,null,null,null,null,null,null,null,null,null,null,null,null,null,null,null,null,null,null,null,null,null,null,null,null,null,null,null,null,null,null,null,null,null,null,null,null,null,null,null,null,null,null,null,null,null,null,null,null,null,null,null,null,null,null,null,null,null,null,null,null,null,null,null,null,null,null,null,null,null,null,null,null,null,null,null,null,null,null,null,null,null,null,null,null,null,null,null,null,null,null,null,null,null,null,null,null,null,null,null,null,null,null,null,null,null,null,null,null,null,null,null,null,null,null,null,null,null,null,null,null,null,null,null,null,null,null,null,null,null,null,null,null,null,null,null,null,null,null,null,null,null,null,null,null,null,null,null,null,null,null,null,null,null,null,null,null,null,null,null,null,null,null,null,null,null,null,null,null,null,null,null,null,null,null,null,null,null,null,null,null,null,null,null,null,null,null,null,null,null,null,null,null,null,null,null,null,null,null,null,null,null,null,null,null,null,null,null,null,null,null,null,null,null,null,null,null,null,null,null,null,null,null,null,null,null,null,null,null,null,null,null,null,null,null,null,null,null,null,null,null,null,null,null,null,null,null,null,null,null,null,null,null,null,null,null,null,null,null,null,null,null,null,null,null,null,null,null,null,null,null,null,null,null,null,null,null,null,null,null,null,null,null,null,null,null,null,null,null,null,null,null,null,null,null,null,null,null,null,null,null,null,null,null,null,null,null,null,null,null,null,null,null,null,null,null,null,null,null,null,null,null,null,null,null,null,null,null,null,null,null,null,null,null,null,null,null,null,null,null,null,null,null,null,null,null,null,null,null,null,null,null,null,null,null,null,null,null,null,null,null,null,null,null,null,null,null,null,null,null,null,null,null,null,null,null,null,null,null,null,null,null,null,null,null,null,null,null,null,null,null,null,null,null,null,null,null,null,null,null,null,null,null,null,null,null,null,null,null,null,null,null,null,null,null,null,null,null,null,null,null,null,null,null,null,null,null,null,null,null,null,null,null,null,null,null,null,null,null,null,null,null,null,null,null,null,null,null,null,null,null,null,null,null,null,null,null,null,null,null,null,null,null,null,null,null,null,null,null,null,null,null,null,null,null,null,null,null,null,null,null,null,null,null,null,null,null,null,null,null,null,null,null,null,null,null,null,null,null,null,null,null,null,null,null,null,null,null,null,null,null,null,null,null,null,null,null,null,null,null,null,null,null,null,null,null,null,null,null,null,null,null,null,null,null,null,null,null,null,null,null,null,null,null,null,null,null,null,null,null,null,null,null,null,null,null,null,null,null,null,null,null,null,null,null,null,null,null,null,null,null,null,null,null,null,null,null,null,null,null,null,null,null,null,null,null,null,null,null,null,null,null,null,null,null,null,null,null,null,null,null,null,null,null,null,null,null,null,null,null,null,null,null,null,null,null,null,null,null,null,null,null,null,null,null,null,null,null,null,null,null,null,null,null,null,null,null,null,null,null,null,null,null,null,null,null,null,null,null,null,null,null,null,null,null,null,null,null,null,null,null,null,null,null,null,null,null,null,null,null,null,null,null,null,null,null,null,null,null,null,null,null,null,null,null,null,null,null,null,null,null,null,null,null,null,null,null,null,null,null,null,null,null,null,null,null,null,null,null,null,null,null,null,null,null,null,null,null,null,null,null,null,null,null,null,null,null,null,null,null,null,null,null,null,null,null,null,null,null,null,null,null,null,null,null,null,null,null,null,null,null,null,null,null,null,null,null,null,null,null,null,null,null,null,null,null,null,null,null,null,null,null,null,null,null,null,null,null,null,null,null,null,null,null,null,null,null,null,null,null,null,null,null,null,null,null,null,null,null,null,null,null,null,null,null,null,null,null,null,null,null,null,null,null,null,null,null,null,null,null,null,null,null,null,null,null,null,null,null,null,null,null,null,null,null,null,null,null,null,null,null,null,null,null,null,null,null,null,null,null,null,null,null,null,null,null,null,null,null,null,null,null,null,null,null,null,null,null,null,null,null,null,null,null,null,null,null,null,null,null,null,null,null,null,null,null,null,null,null,null,null,null,null,null,null,null,null,null,null,null,null,null,null,null,null,null,null,null,null,null,null,null,null,null,null,null,null,null,null,null,null,null,null,null,null,null,null,null,null,null,null,null,null,null,null,null,null,null,null,null,null,null,null,null,null,null,null,null,null,null,null,null,null,null,null,null,null,null,null,null,null,null,null,null,null,null,null,null,null,null,null,null,null,null,null,null,null,null,null,null,null,null,null,null,null,null,null,null,null,null,null,null,null,null,null,null,null,null,null,null,null,null,null,null,null,null,null,null,null,null,null,null,null,null,null,null,null,null,null,null,null,null,null,null,null,null,null,null,null,null,null,null,null,null,null,null,null,null,null,null,null,null,null,null,null,null,null,null,null,null,null,null,null,null,null,null,null,null,null,null,null,null,null,null,null,null,null,null,null,null,null,null,null,null,null,null,null,null,null,null,null,null,null,null,null,null,null,null,null,null,null,null,null,null,null,null,null,null,null,null,null,null,null,null,null,null,null,null,null,null,null,null,null,null,null,null,null,null,null,null,null,null,null,null,null,null,null,null,null,null,null,null,null,null,null,null,null,null,null,null,null,null,null,null,null,null,null,null,null,null,null,null,null,null,null,null,null,null,null,null,null,null,null,null,null,null,null,null,null,null,null,null,null,null,null,null,null,null,null,null,null,null,null,null,null,null,null,null,null,null,null,null,null,null,null,null,null,null,null,null,null,null,null,null,null,null,null,null,null,null,null,null,null,null,null,null,null,null,null,null,null,null,null,null,null,null,null,null,null,null,null,null,null,null,null,null,null,null,null,null,null,null,null,null,null,null,null,null,null,null,null,null,null,null,null,null,null,null,null,null,null,null,null,null,null,null,null,null,null,null,null,null,null,null,null,null,null,null,null,null,null,null,null,null,null,null,null,null,null,null,null,null,null,null,null,null,null,null,null,null,null,null,null,null,null,null,null,null,null,null,null,null,null,null,null,null,null,null,null,null,null,null,null,null,null,null,null,null,null,null,null,null,null,null,null,null,null,null,null,null,null,null,null,null,null,null,null,null,null,null,null,null,null,null,null,null,null,null,null,null,null,null,null,null,null,null,null,null,null,null,null,null,null,null,null,null,null,null,null,null,null,null,null,null,null,null,null,null,null,null,null,null,null,null,null,null,null,null,null,null,null,null,null,null,null,null,null,null,null,null,null,null,null,null,null,null,null,null,null,null,null,null,null,null,null,null,null,null,null,null,null,null,null,null,null,null,null,null,null,null,null,null,null,null,null,null,null,null,null,null,null,null,null,null,null,null,null,null,null,null,null,null,null,null,null,null,null,null,null,null,null,null,null,null,null,null,null,null,null,null,null,null,null,null,null,null,null,null,null,null,null,null,null,null,null,null,null,null,null,null,null,null,null,null,null,null,null,null,null,null,null,null,null,null,null,null,null,null,null,null,null,null,null,null,null,null,null,null,null,null,null,null,null,null,null,null,null,null,null,null,null,null,null,null,null,null,null,null,null,null,null,null,null,null,null,null,null,null,null,null,null,null,null,null,null,null,null,null,null,null,null,null,null,null,null,null,null,null,null,null,null,null,null,null,null,null,null,null,null,null,null,null,null,null,null,null,null,null,null,null,null,null,null,null,null,null,null,null,null,null,null,null,null,null,null,null,null,null,null,null,null,null,null,null,null,null,null,null,null,null,null,null,null,null,null,null,null,null,null,null,null,null,null,null,null,null,null,null,null,null,null,null,null,null,null,null,null,null,null,null,null,null,null,null,null,null,null,null,null,null,null,null,null,null,null,null,null,null,null,null,null,null,null,null,null,null,null,null,null,null,null,null,null,null,null,null,null,null,null,null,null,null,null,null,null,null,null,null,null,null,null,null,null,null,null,null,null,null,null,null,null,null,null,null,null,null,null,null,null,null,null,null,null,null,null,null,null,null,null,null,null,null,null,null,null,null,null,null,null,null,null,null,null,null,null,null,null,null,null,null,null,null,null,null,null,null,null,null,null,null,null,null,null,null,null,null,null,null,null,null,null,null,null,null,null,null,null,null,null,null,null,null,null,null,null,null,null,null,null,null,null,null,null,null,null,null,null,null,null,null,null,null,null,null,null,null,null,null,null,null,null,null,null,null,null,null,null,null,null,null,null,null,null,null,null,null,null,null,null,null,null,null,null,null,null,null,null,null,null,null,null,null,null,null,null,null,null,null,null,null,null,null,null,null,null,null,null,null,null,null,null,null,null,null,null,null,null,null,null,null,null,null,null,null,null,null,null,null,null,null,null,null,null,null,null,null,null,null,null,null,null,null,null,null,null,null,null,null,null,null,null,null,null,null,null,null,null,null,null,null,null,null,null,null,null,null,null,null,null,null,null,null,null,null,null,null,null,null,null,null,null,null,null,null,null,null,null,null,null,null,null,null,null,null,null,null,null,null,null,null,null,null,null,null,null,null,null,null,null,null,null,null,null,null,null,null,null,null,null,null,null,null,null,null,null,null,null,null,null,null,null,null,null,null,null,null,null,null,null,null,null,null,null,null,null,null,null,null,null,null,null,null,null,null,null,null,null,null,null,null,null,null,null,null,null,null,null,null,null,null,null,null,null,null,null,null,null,null,null,null,null,null,null,null,null,null,null,null,null,null,null,null,null,null,null,null,null,null,null,null,null,null,null,null,null,null,null,null,null,null,null,null,null,null,null,null,null,null,null,null,null,null,null,null,null,null,null,null,null,null,null,null,null,null,null,null,null,null,null,null,null,null,null,null,null,null,null,null,null,null,null,null,null,null,null,null,null,null,null,null,null,null,null,null,null,null,null,null,null,null,null,null,null,null,null,null,null,null,null,null,null,null,null,null,null,null,null,null,null,null,null,null,null,null,null,null,null,null,null,null,null,null,null,null,null,null,null,null,null,null,null,null,null,null,null,null,null,null,null,null,null,null,null,null,null,null,null,null,null,null,null,null,null,null,null,null,null,null,null,null,null,null,null,null,null,null,null,null,null,null,null,null,null,null,null,null,null,null,null,null,null,null,null,null,null,null,null,null,null,null,null,null,null,null,null,null,null,null,null,null,null,null,null,null,null,null,null,null,null,null,null,null,null,null,null,null,null,null,null,null,null,null,null,null,null,null,null,null,null,null,null,null,null,null,null,null,null,null,null,null,null,null,null,null,null,null,null,null,null,null,null,null,null,null,null,null,null,null,null,null,null,null,null,null,null,null,null,null,null,null,null,null,null,null,null,null,null,null,null,null,null,null,null,null,null,null,null,null,null,null,null,null,null,null,null,null,null,null,null,null,null,null,null,null,null,null,null,null,null,null,null,null,null,null,null,null,null,null,null,null,null,null,null,null,null,null,null,null,null,null,null,null,null,null,null,null,null,null,null,null,null,null,null,null,null,null,null,null,null,null,null,null,null,null,null,null,null,null,null,null,null,null,null,null,null,null,null,null,null,null,null,null,null,null,null,null,null,null,null,null,null,null,null,null,null,null,null,null,null,null,null,null,null,null,null,null,null,null,null,null,null,null,null,null,null,null,null,null,null,null,null,null,null,null,null,null,null,null,null,null,null,null,null,null,null,null,null,null,null,null,null,null,null,null,null,null,null,null,null,null,null,null,null,null,null,null,null,null,null,null,null,null,null,null,null,null,null,null,null,null,null,null,null,null,null,null,null,null,null,null,null,null,null,null,null,null,null,null,null,null,null,null,null,null,null,null,null,null,null,null,null,null,null,null,null,null,null,null,null,null,null,null,null,null,null,null,null,null,null,null,null,null,null,null,null,null,null,null,null,null,null,null,null,null,null,null,null,null,null,null,null,null,null,null,null,null,null,null,null,null,null,null,null,null,null,null,null,null,null,null,null,null,null,null,null,null,null,null,null,null,null,null,null,null,null,null,null,null,null,null,null,null,null,null,null,null,null,null,null,null,null,null,null,null,null,null,null,null,null,null,null,null,null,null,null,null,null,null,null,null,null,null,null,null,null,null,null,null,null,null,null,null,null,null,null,null,null,null,null,null,null,null,null,null,null,null,null,null,null,null,null,null,null,null,null,null,null,null,null,null,null,null,null,null,null,null,null,null,null,null,null,null,null,null,null,null,null,null,null,null,null,null,null,null,null,null,null,null,null,null,null,null,null,null,null,null,null,null,null,null,null,null,null,null,null,null,null,null,null,null,null,null,null,null,null,null,null,null,null,null,null,null,null,null,null,null,null,null,null,null,null,null,null,null,null,null,null,null,null,null,null,null,null,null,null,null,null,null,null,null,null,null,null,null,null,null,null,null,null,null,null,null,null,null,null,null,null,null,null,null,null,null,null,null,null,null,null,null,null,null,null,null,null,null,null,null,null,null,null,null,null,null,null,null,null,null,null,null,null,null,null,null,null,null,null,null,null,null,null,null,null,null,null,null,null,null,null,null,null,null,null,null,null,null,null,null,null,null,null,null,null,null,null,null,null,null,null,null,null,null,null,null,null,null,null,null,null,null,null,null,null,null,null,null,null,null,null,null,null,null,null,null,null,null,null,null,null,null,null,null,null,null,null,null,null,null,null,null,null,null,null,null,null,null,null,null,null,null,null,null,null,null,null,null,null,null,null,null,null,null,null,null,null,null,null,null,null,null,null,null,null,null,null,null,null,null,null,null,null,null,null,null,null,null,null,null,null,null,null,null,null,null,null,null,null,null,null,null,null,null,null,null,null,null,null,null,null,null,null,null,null,null,null,null,null,null,null,null,null,null,null,null,null,null,null,null,null,null,null,null,null,null,null,null,null,null,null,null,null,null,null,null,null,null,null,null,null,null,null,null,null,null,null,null,null,null,null,null,null,null,null,null,null,null,null,null,null,null,null,null,null,null,null,null,null,null,null,null,null,null,null,null,null,null,null,null,null,null,null,null,null,null,null,null,null,null,null,null,null,null,null,null,null,null,null,null,null,null,null,null,null,null,null,null,null,null,null,null,null,null,null,null,null,null,null,null,null,null,null,null,null,null,null,null,null,null,null,null,null,null,null,null,null,null,null,null,null,null,null,null,null,null,null,null,null,null,null,null,null,null,null,null,null,null,null,null,null,null,null,null,null,null,null,null,null,null,null,null,null,null,null,null,null,null,null,null,null,null,null,null,null,null,null,null,null,null,null,null,null,null,null,null,null,null,null,null,null,null,null,null,null,null,null,null,null,null,null,null,null,null,null,null,null,null,null,null,null,null,null,null,null,null,null,null,null,null,null,null,null,null,null,null,null,null,null,null,null,null,null,null,null,null,null,null,null,null,null,null,null,null,null,null,null,null,null,null,null,null,null,null,null,null,null,null,null,null,null,null,null,null,null,null,null,null,null,null,null,null,null,null,null,null,null,null,null,null,null,null,null,null,null,null,null,null,null,null,null,null,null,null,null,null,null,null,null,null,null,null,null,null,null,null,null,null,null,null,null,null,null,null,null,null,null,null,null,null,null,null,null,null,null,null,null,null,null,null,null,null,null,null,null,null,null,null,null,null,null,null,null,null,null,null,null,null,null,null,null,null,null,null,null,null,null,null,null,null,null,null,null,null,null,null,null,null,null,null,null,null,null,null,null,null,null,null,null,null,null,null,null,null,null,null,null,null,null,null,null,null,null,null,null,null,null,null,null,null,null,null,null,null,null,null,null,null,null,null,null,null,null,null,null,null,null,null,null,null,null,null,null,null,null,null,null,null,null,null,null,null,null,null,null,null,null,null,null,null,null,null,null,null,null,null,null,null,null,null,null,null,null,null,null,null,null,null,null,null,null,null,null,null,null,null,null,null,null,null,null,null,null,null,null,null,null,null,null,null,null,null,null,null,null,null,null,null,null,null,null,null,null,null,null,null,null,null,null,null,null,null,null,null,null,null,null,null,null,null,null,null,null,null,null,null,null,null,null,null,null,null,null,null,null,null,null,null,null,null,null,null,null,null,null,null,null,null,null,null,null,null,null,null,null,null,null,null,null,null,null,null,null,null,null,null,null,null,null,null,null,null,null,null,null,null,null,null,null,null,null,null,null,null,null,null,null,null,null,null,null,null,null,null,null,null,null,null,null,null,null,null,null,null,null,null,null,null,null,null,null,null,null,null,null,null,null,null,null,null,null,null,null,null,null,null,null,null,null,null,null,null,null,null,null,null,null,null,null,null,null,null,null,null,null,null,null,null,null,null,null,null,null,null,null,null,null,null,null,null,null,null,null,null,null,null,null,null,null,null,null,null,null,null,null,null,null,null,null,null,null,null,null,null,null,null,null,null,null,null,null,null,null,null,null,null,null,null,null,null,null,null,null,null,null,null,null,null,null,null,null,null,null,null,null,null,null,null,null,null,null,null,null,null,null,null,null,null,null,null,null,null,null,null,null,null,null,null,null,null,null,null,null,null,null,null,null,null,null,null,null,null,null,null,null,null,null,null,null,null,null,null,null,null,null,null,null,null,null,null,null,null,null,null,null,null,null,null,null,null,null,null,null,null,null,null,null,null,null,null,null,null,null,null,null,null,null,null,null,null,null,null,null,null,null,null,null,null,null,null,null,null,null,null,null,null,null,null,null,null,null,null,null,null,null,null,null,null,null,null,null,null,null,null,null,null,null,null,null,null,null,null,null,null,null,null,null,null,null,null,null,null,null,null,null,null,null,null,null,null,null,null,null,null,null,null,null,null,null,null,null,null,null,null,null,null,null,null,null,null,null,null,null,null,null,null,null,null,null,null,null,null,null,null,null,null,null,null,null,null,null,null,null,null,null,null,null,null,null,null,null,null,null,null,null,null,null,null,null,null,null,null,null,null,null,null,null,null,null,null,null,null,null,null,null,null,null,null,null,null,null,null,null,null,null,null,null,null,null,null,null,null,null,null,null,null,null,null,null,null,null,null,null,null,null,null,null,null,null,null,null,null,null,null,null,null,null,null,null,null,null,null,null,null,null,null,null,null,null,null,null,null,null,null,null,null,null,null,null,null,null,null,null,null,null,null,null,null,null,null,null,null,null,null,null,null,null,null,null,null,null,null,null,null,null,null,null,null,null,null,null,null,null,null,null,null,null,null,null,null,null,null,null,null,null,null,null,null,null,null,null,null,null,null,null,null,null,null,null,null,null,null,null,null,null,null,null,null,null,null,null,null,null,null,null,null,null,null,null,null,null,null,null,null,null,null,null,null,null,null,null,null,null,null,null,null,null,null,null,null,null,null,null,null,null,null,null,null,null,null,null,null,null,null,null,null,null,null,null,null,null,null,null,null,null,null,null,null,null,null,null,null,null,null,null,null,null,null,null,null,null,null,null,null,null,null,null,null,null,null,null,null,null,null,null,null,null,null,null,null,null,null,null,null,null,null,null,null,null,null,null,null,null,null,null,null,null,null,null,null,null,null,null,null,null,null,null,null,null,null,null,null,null,null,null,null,null,null,null,null,null,null,null,null,null,null,null,null,null,null,null,null,null,null,null,null,null,null,null,null,null,null,null,null,null,null,null,null,null,null,null,null,null,null,null,null,null,null,null,null,null,null,null,null,null,null,null,null,null,null,null,null,null,null,null,null,null,null,null,null,null,null,null,null,null,null,null,null,null,null,null,null,null,null,null,null,null,null,null,null,null,null,null,null,null,null,null,null,null,null,null,null,null,null,null,null,null,null,null,null,null,null,null,null,null,null,null,null,null,null,null,null,null,null,null,null,null,null,null,null,null,null,null,null,null,null,null,null,null,null,null,null,null,null,null,null,null,null,null,null,null,null,null,null,null,null,null,null,null,null,null,null,null,null,null,null,null,null,null,null,null,null,null,null,null,null,null,null,null,null,null,null,null,null,null,null,null,null,null,null,null,null,null,null,null,null,null,null,null,null,null,null,null,null,null,null,null,null,null,null,null,null,null,null,null,null,null,null,null,null,null,null,null,null,null,null,null,null,null,null,null,null,null,null,null,null,null,null,null,null,null,null,null,null,null,null,null,null,null,null,null,null,null,null,null,null,null,null,null,null,null,null,null,null,null,null,null,null,null,null,null,null,null,null,null,null,null,null,null,null,null,null,null,null,null,null,null,null,null,null,null,null,null,null,null,null,null,null,null,null,null,null,null,null,null,null,null,null,null,null,null,null,null,null,null,null,null,null,null,null,null,null,null,null,null,null,null,null,null,null,null,null,null,null,null,null,null,null,null,null,null,null,null,null,null,null,null,null,null,null,null,null,null,null,null,null,null,null,null,null,null,null,null,null,null,null,null,null,null,null,null,null,null,null,null,null,null,null,null,null,null,null,null,null,null,null,null,null,null,null,null,null,null,null,null,null,null,null,null,null,null,null,null,null,null,null,null,null,null,null,null,null,null,null,null,null,null,null,null,null,null,null,null,null,null,null,null,null,null,null,null,null,null,null,null,null,null,null,null,null,null,null,null,null,null,null,null,null,null,null,null,null,null,null,null,null,null,null,null,null,null,null,null,null,null,null,null,null,null,null,null,null,null,null,null,null,null,null,null,null,null,null,null,null,null,null,null,null,null,null,null,null,null,null,null,null,null,null,null,null,null,null,null,null,null,null,null,null,null,null,null,null,null,null,null,null,null,null,null,null,null,null,null,null,null,null,null,null,null,null,null,null,null,null,null,null,null,null,null,null,null,null,null,null,null,null,null,null,null,null,null,null,null,null,null,null,null,null,null,null,null,null,null,null,null,null,null,null,null,null,null,null,null,null,null,null,null,null,null,null,null,null,null,null,null,null,null,null,null,null,null,null,null,null,null,null,null,null,null,null,null,null,null,null,null,null,null,null,null,null,null,null,null,null,null,null,null,null,null,null,null,null,null,null,null,null,null,null,null,null,null,null,null,null,null,null,null,null,null,null,null,null,null,null,null,null,null,null,null,null,null,null,null,null,null,null,null,null,null,null,null,null,null,null,null,null,null,null,null,null,null,null,null,null,null,null,null,null,null,null,null,null,null,null,null,null,null,null,null,null,null,null,null,null,null,null,null,null,null,null,null,null,null,null,null,null,null,null,null,null,null,null,null,null,null,null,null,null,null,null,null,null,null,null,null,null,null,null,null,null,null,null,null,null,null,null,null,null,null,null,null,null,null,null,null,null,null,null,null,null,null,null,null,null,null,null,null,null,null,null,null,null,null,null,null,null,null,null,null,null,null,null,null,null,null,null,null,null,null,null,null,null,null,null,null,null,null,null,null,null,null,null,null,null,null,null,null,null,null,null,null,null,null,null,null,null,null,null,null,null,null,null,null,null,null,null,null,null,null,null,null,null,null,null,null,null,null,null,null,null,null,null,null,null,null,null,null,null,null,null,null,null,null,null,null,null,null,null,null,null,null,null,null,null,null,null,null,null,null,null,null,null,null,null,null,null,null,null,null,null,null,null,null,null,null,null,null,null,null,null,null,null,null,null,null,null,null,null,null,null,null,null,null,null,null,null,null,null,null,null,null,null,null,null,null,null,null,null,null,null,null,null,null,null,null,null,null,null,null,null,null,null,null,null,null,null,null,null,null,null,null,null,null,null,null,null,null,null,null,null,null,null,null,null,null,null,null,null,null,null,null,null,null,null,null,null,null,null,null,null,null,null,null,null,null,null,null,null,null,null,null,null,null,null,null,null,null,null,null,null,null,null,null,null,null,null,null,null,null,null,null,null,null,null,null,null,null,null,null,null,null,null,null,null,null,null,null,null,null,null,null,null,null,null,null,null,null,null,null,null,null,null,null,null,null,null,null,null,null,null,null,null,null,null,null,null,null,null,null,null,null,null,null,null,null,null,null,null,null,null,null,null,null,null,null,null,null,null,null,null,null,null,null,null,null,null,null,null,null,null,null,null,null,null,null,null,null,null,null,null,null,null,null,null,null,null,null,null,null,null,null,null,null,null,null,null,null,null,null,null,null,null,null,null,null,null,null,null,null,null,null,null,null,null,null,null,null,null,null,null,null,null,null,null,null,null,null,null,null,null,null,null,null,null,null,null,null,null,null,null,null,null,null,null,null,null,null,null,null,null,null,null,null,null,null,null,null,null,null,null,null,null,null,null,null,null,null,null,null,null,null,null,null,null,null,null,null,null,null,null,null,null,null,null,null,null,null,null,null,null,null,null,null,null,null,null,null,null,null,null,null,null,null,null,null,null,null,null,null,null,null,null,null,null,null,null,null,null,null,null,null,null,null,null,null,null,null,null,null,null,null,null,null,null,null,null,null,null,null,null,null,null,null,null,null,null,null,null,null,null,null,null,null,null,null,null,null,null,null,null,null,null,null,null,null,null,null,null,null,null,null,null,null,null,null,null,null,null,null,null,null,null,null,null,null,null,null,null,null,null,null,null,null,null,null,null,null,null,null,null,null,null,null,null,null,null,null,null,null,null,null,null,null,null,null,null,null,null,null,null,null,null,null,null,null,null,null,null,null,null,null,null,null,null,null,null,null,null,null,null,null,null,null,null,null,null,null,null,null,null,null,null,null,null,null,null,null,null,null,null,null,null,null,null,null,null,null,null,null,null,null,null,null,null,null,null,null,null,null,null,null,null,null,null,null,null,null,null,null,null,null,null,null,null,null,null,null,null,null,null,null,null,null,null,null,null,null,null,null,null,null,null,null,null,null,null,null,null,null,null,null,null,null,null,null,null,null,null,null,null,null,null,null,null,null,null,null,null,null,null,null,null,null,null,null,null,null,null,null,null,null,null,null,null,null,null,null,null,null,null,null,null,null,null,null,null,null,null,null,null,null,null,null,null,null,null,null,null,null,null,null,null,null,null,null,null,null,null,null,null,null,null,null,null,null,null,null,null,null,null,null,null,null,null,null,null,null,null,null,null,null,null,null,null,null,null,null,null,null,null,null,null,null,null,null,null,null,null,null,null,null,null,null,null,null,null,null,null,null,null,null,null,null,null,null,null,null,null,null,null,null,null,null,null,null,null,null,null,null,null,null,null,null,null,null,null,null,null,null,null,null,null,null,null,null,null,null,null,null,null,null,null,null,null,null,null,null,null,null,null,null,null,null,null,null,null,null,null,null,null,null,null,null,null,null,null,null,null,null,null,null,null,null,null,null,null,null,null,null,null,null,null,null,null,null,null,null,null,null,null,null,null,null,null,null,null,null,null,null,null,null,null,null,null,null,null,null,null,null,null,null,null,null,null,null,null,null,null,null,null,null,null,null,null,null,null,null,null,null,null,null,null,null,null,null,null,null,null,null,null,null,null,null,null,null,null,null,null,null,null,null,null,null,null,null,null,null,null,null,null,null,null,null,null,null,null,null,null,null,null,null,null,null,null,null,null,null,null,null,null,null,null,null,null,null,null,null,null,null,null,null,null,null,null,null,null,null,null,null,null,null,null,null,null,null,null,null,null,null,null,null,null,null,null,null,null,null,null,null,null,null,null,null,null,null,null,null,null,null,null,null,null,null,null,null,null,null,null,null,null,null,null,null,null,null,null,null,null,null,null,null,null,null,null,null,null,null,null,null,null,null,null,null,null,null,null,null,null,null,null,null,null,null,null,null,null,null,null,null,null,null,null,null,null,null,null,null,null,null,null,null,null,null,null,null,null,null,null,null,null,null,null,null,null,null,null,null,null,null,null,null,null,null,null,null,null,null,null,null,null,null,null,null,null,null,null,null,null,null,null,null,null,null,null,null,null,null,null,null,null,null,null,null,null,null,null,null,null,null,null,null,null,null,null,null,null,null,null,null,null,null,null,null,null,null,null,null,null,null,null,null,null,null,null,null,null,null,null,null,null,null,null,null,null,null,null,null,null,null,null,null,null,null,null,null,null,null,null,null,null,null,null,null,null,null,null,null,null,null,null,null,null,null,null,null,null,null,null,null,null,null,null,null,null,null,null,null,null,null,null,null,null,null,null,null,null,null,null,null,null,null,null,null,null,null,null,null,null,null,null,null,null,null,null,null,null,null,null,null,null,null,null,null,null,null,null,null,null,null,null,null,null,null,null,null,null,null,null,null,null,null,null,null,null,null,null,null,null,null,null,null,null,null,null,null,null,null,null,null,null,null,null,null,null,null,null,null,null,null,null,null,null,null,null,null,null,null,null,null,null,null,null,null,null,null,null,null,null,null,null,null,null,null,null,null,null,null,null,null,null,null,null,null,null,null,null,null,null,null,null,null,null,null,null,null,null,null,null,null,null,null,null,null,null,null,null,null,null,null,null,null,null,null,null,null,null,null,null,null,null,null,null,null,null,null,null,null,null,null,null,null,null,null,null,null,null,null,null,null,null,null,null,null,null,null,null,null,null,null,null,null,null,null,null,null,null,null,null,null,null,null,null,null,null,null,null,null,null,null,null,null,null,null,null,null,null,null,null,null,null,null,null,null,null,null,null,null,null,null,null,null,null,null,null,null,null,null,null,null,null,null,null,null,null,null,null,null,null,null,null,null,null,null,null,null,null,null,null,null,null,null,null,null,null,null,null,null,null,null,null,null,null,null,null,null,null,null,null,null,null,null,null,null,null,null,null,null,null,null,null,null,null,null,null,null,null,null,null,null,null,null,null,null,null,null,null,null,null,null,null,null,null,null,null,null,null,null,null,null,null,null,null,null,null,null,null,null,null,null,null,null,null,null,null,null,null,null,null,null,null,null,null,null,null,null,null,null,null,null,null,null,null,null,null,null,null,null,null,null,null,null,null,null,null,null,null,null,null,null,null,null,null,null,null,null,null,null,null,null,null,null,null,null,null,null,null,null,null,null,null,null,null,null,null,null,null,null,null,null,null,null,null,null,null,null,null,null,null,null,null,null,null,null,null,null,null,null,null,null,null,null,null,null,null,null,null,null,null,null,null,null,null,null,null,null,null,null,null,null,null,null,null,null,null,null,null,null,null,null,null,null,null,null,null,null,null,null,null,null,null,null,null,null,null,null,null,null,null,null,null,null,null,null,null,null,null,null,null,null,null,null,null,null,null,null,null,null,null,null,null,null,null,null,null,null,null,null,null,null,null,null,null,null,null,null,null,null,null,null,null,null,null,null,null,null,null,null,null,null,null,null,null,null,null,null,null,null,null,null,null,null,null,null,null,null,null,null,null,null,null,null,null,null,null,null,null,null,null,null,null,null,null,null,null,null,null,null,null,null,null,null,null,null,null,null,null,null,null,null,null,null,null,null,null,null,null,null,null,null,null,null,null,null,null,null,null,null,null,null,null,null,null,null,null,null,null,null,null,null,null,null,null,null,null,null,null,null,null,null,null,null,null,null,null,null,null,null,null,null,null,null,null,null,null,null,null,null,null,null,null,null,null,null,null,null,null,null,null,null,null,null,null,null,null,null,null,null,null,null,null,null,null,null,null,null,null,null,null,null,null,null,null,null,null,null,null,null,null,null,null,null,null,null,null,null,null,null,null,null,null,null,null,null,null,null,null,null,null,null,null,null,null,null,null,null,null,null,null,null,null,null,null,null,null,null,null,null,null,null,null,null,null,null,null,null,null,null,null,null,null,null,null,null,null,null,null,null,null,null,null,null,null,null,null,null,null,null,null,null,null,null,null,null,null,null,null,null,null,null,null,null,null,null,null,null,null,null,null,null,null,null,null,null,null,null,null,null,null,null,null,null,null,null,null,null,null,null,null,null,null,null,null,null,null,null,null,null,null,null,null,null,null,null,null,null,null,null,null,null,null,null,null,null,null,null,null,null,null,null,null,null,null,null,null,null,null,null,null,null,null,null,null,null,null,null,null,null,null,null,null,null,null,null,null,null,null,null,null,null,null,null,null,null,null,null,null,null,null,null,null,null,null,null,null,null,null,null,null,null,null,null,null,null,null,null,null,null,null,null,null,null,null,null,null,null,null,null,null,null,null,null,null,null,null,null,null,null,null,null,null,null,null,null,null,null,null,null,null,null,null,null,null,null,null,null,null,null,null,null,null,null,null,null,null,null,null,null,null,null,null,null,null,null,null,null,null,null,null,null,null,null,null,null,null,null,null,null,null,null,null,null,null,null,null,null,null,null,null,null,null,null,null,null,null,null,null,null,null,null,null,null,null,null,null,null,null,null,null,null,null,null,null,null,null,null,null,null,null,null,null,null,null,null,null,null,null,null,null,null,null,null,null,null,null,null,null,null,null,null,null,null,null,null,null,null,null,null,null,null,null,null,null,null,null,null,null,null,null,null,null,null,null,null,null,null,null,null,null,null,null,null,null,null,null,null,null,null,null,null,null,null,null,null,null,null,null,null,null,null,null,null,null,null,null,null,null,null,null,null,null,null,null,null,null,null,null,null,null,null,null,null,null,null,null,null,null,null,null,null,null,null,null,null,null,null,null,null,null,null,null,null,null,null,null,null,null,null,null,null,null,null,null,null,null,null,null,null,null,null,null,null,null,null,null,null,null,null,null,null,null,null,null,null,null,null,null,null,null,null,null,null,null,null,null,null,null,null,null,null,null,null,null,null,null,null,null,null,null,null,null,null,null,null,null,null,null,null,null,null,null,null,null,null,null,null,null,null,null,null,null,null,null,null,null,null,null,null,null,null,null,null,null,null,null,null,null,null,null,null,null,null,null,null,null,null,null,null,null,null,null,null,null,null,null,null,null,null,null,null,null,null,null,null,null,null,null,null,null,null,null,null,null,null,null,null,null,null,null,null,null,null,null,null,null,null,null,null,null,null,null,null,null,null,null,null,null,null,null,null,null,null,null,null,null,null,null,null,null,null,null,null,null,null,null,null,null,null,null,null,null,null,null,null,null,null,null,null,null,null,null,null,null,null,null,null,null,null,null,null,null,null,null,null,null,null,null,null,null,null,null,null,null,null,null,null,null,null,null,null,null,null,null,null,null,null,null,null,null,null,null,null,null,null,null,null,null,null,null,null,null,null,null,null,null,null,null,null,null,null,null,null,null,null,null,null,null,null,null,null,null,null,null,null,null,null,null,null,null,null,null,null,null,null,null,null,null,null,null,null,null,null,null,null,null,null,null,null,null,null,null,null,null,null,null,null,null,null,null,null,null,null,null,null,null,null,null,null,null,null,null,null,null,null,null,null,null,null,null,null,null,null,null,null,null,null,null,null,null,null,null,null,null,null,null,null,null,null,null,null,null,null,null,null,null,null,null,null,null,null,null,null,null,null,null,null,null,null,null,null,null,null,null,null,null,null,null,null,null,null,null,null,null,null,null,null,null,null,null,null,null,null,null,null,null,null,null,null,null,null,null,null,null,null,null,null,null,null,null,null,null,null,null,null,null,null,null,null,null,null,null,null,null,null,null,null,null,null,null,null,null,null,null,null,null,null,null,null,null,null,null,null,null,null,null,null,null,null,null,null,null,null,null,null,null,null,null,null,null,null,null,null,null,null,null,null,null,null,null,null,null,null,null,null,null,null,null,null,null,null,null,null,null,null,null,null,null,null,null,null,null,null,null,null,null,null,null,null,null,null,null,null,null,null,null,null,null,null,null,null,null,null,null,null,null,null,null,null,null,null,null,null,null,null,null,null,null,null,null,null,null,null,null,null,null,null,null,null,null,null,null,null,null,null,null,null,null,null,null,null,null,null,null,null,null,null,null,null,null,null,null,null,null,null,null,null,null,null,null,null,null,null,null,null,null,null,null,null,null,null,null,null,null,null,null,null,null,null,null,null,null,null,null,null,null,null,null,null,null,null,null,null,null,null,null,null,null,null,null,null,null,null,null,null,null,null,null,null,null,null,null,null,null,null,null,null,null,null,null,null,null,null,null,null,null,null,null,null,null,null,null,null,null,null,null,null,null,null,null,null,null,null,null,null,null,null,null,null,null,null,null,null,null,null,null,null,null,null,null,null,null,null,null,null,null,null,null,null,null,null,null,null,null,null,null,null,null,null,null,null,null,null,null,null,null,null,null,null,null,null,null,null,null,null,null,null,null,null,null,null,null,null,null,null,null,null,null,null,null,null,null,null,null,null,null,null,null,null,null,null,null,null,null,null,null,null,null,null,null,null,null,null,null,null,null,null,null,null,null,null,null,null,null,null,null,null,null,null,null,null,null,null,null,null,null,null,null,null,null,null,null,null,null,null,null,null,null,null,null,null,null,null,null,null,null,null,null,null,null,null,null,null,null,null,null,null,null,null,null,null,null,null,null,null,null,null,null,null,null,null,null,null,null,null,null,null,null,null,null,null,null,null,null,null,null,null,null,null,null,null,null,null,null,null,null,null,null,null,null,null,null,null,null,null,null,null,null,null,null,null,null,null,null,null,null,null,null,null,null,null,null,null,null,null,null,null,null,null,null,null,null,null,null,null,null,null,null,null,null,null,null,null,null,null,null,null,null,null,null,null,null,null,null,null,null,null,null,null,null,null,null,null,null,null,null,null,null,null,null,null,null,null,null,null,null,null,null,null,null,null,null,null,null,null,null,null,null,null,null,null,null,null,null,null,null,null,null,null,null,null,null,null,null,null,null,null,null,null,null,null,null,null,null,null,null,null,null,null,null,null,null,null,null,null,null,null,null,null,null,null,null,null,null,null,null,null,null,null,null,null,null,null,null,null,null,null,null,null,null,null,null,null,null,null,null,null,null,null,null,null,null,null,null,null,null,null,null,null,null,null,null,null,null,null,null,null,null,null,null,null,null,null,null,null,null,null,null,null,null,null,null,null,null,null,null,null,null,null,null,null,null,null,null,null,null,null,null,null,null,null,null,null,null,null,null,null,null,null,null,null,null,null,null,null,null,null,null,null,null,null,null,null,null,null,null,null,null,null,null,null,null,null,null,null,null,null,null,null,null,null,null,null,null,null,null,null,null,null,null,null,null,null,null,null,null,null,null,null,null,null,null,null,null,null,null,null,null,null,null,null,null,null,null,null,null,null,null,null,null,null,null,null,null,null,null,null,null,null,null,null,null,null,null,null,null,null,null,null,null,null,null,null,null,null,null,null,null,null,null,null,null,null,null,null,null,null,null,null,null,null,null,null,{"$f":"IF(SUM(COUNTIF(C31:C39,\">=1\"))>=1,\"yes\",\"no\")","v":"no"}]
["Total mitigation points for field/management unit",null,{"$f":"SUM(C53,C43:C49,C31:C39,C26:C27,C9,C13,C21:C22,C17)","v":0},null,null,null,null,null,null,null,null,null,null,null,null,null,null,null,null,null,null,null,null,null,null,null,null,null,null,null,null,null,null,null,null,null,null,null,null,null,null,null,null,null,null,null,null,null,null,null,null,null,null,null,null,null,null,null,null,null,null,null,null,null,null,null,null,null,null,null,null,null,null,null,null,null,null,null,null,null,null,null,null,null,null,null,null,null,null,null,null,null,null,null,null,null,null,null,null,null,null,null,null,null,null,null,null,null,null,null,null,null,null,null,null,null,null,null,null,null,null,null,null,null,null,null,null,null,null,null,null,null,null,null,null,null,null,null,null,null,null,null,null,null,null,null,null,null,null,null,null,null,null,null,null,null,null,null,null,null,null,null,null,null,null,null,null,null,null,null,null,null,null,null,null,null,null,null,null,null,null,null,null,null,null,null,null,null,null,null,null,null,null,null,null,null,null,null,null,null,null,null,null,null,null,null,null,null,null,null,null,null,null,null,null,null,null,null,null,null,null,null,null,null,null,null,null,null,null,null,null,null,null,null,null,null,null,null,null,null,null,null,null,null,null,null,null,null,null,null,null,null,null,null,null,null,null,null,null,null,null,null,null,null,null,null,null,null,null,null,null,null,null,null,null,null,null,null,null,null,null,null,null,null,null,null,null,null,null,null,null,null,null,null,null,null,null,null,null,null,null,null,null,null,null,null,null,null,null,null,null,null,null,null,null,null,null,null,null,null,null,null,null,null,null,null,null,null,null,null,null,null,null,null,null,null,null,null,null,null,null,null,null,null,null,null,null,null,null,null,null,null,null,null,null,null,null,null,null,null,null,null,null,null,null,null,null,null,null,null,null,null,null,null,null,null,null,null,null,null,null,null,null,null,null,null,null,null,null,null,null,null,null,null,null,null,null,null,null,null,null,null,null,null,null,null,null,null,null,null,null,null,null,null,null,null,null,null,null,null,null,null,null,null,null,null,null,null,null,null,null,null,null,null,null,null,null,null,null,null,null,null,null,null,null,null,null,null,null,null,null,null,null,null,null,null,null,null,null,null,null,null,null,null,null,null,null,null,null,null,null,null,null,null,null,null,null,null,null,null,null,null,null,null,null,null,null,null,null,null,null,null,null,null,null,null,null,null,null,null,null,null,null,null,null,null,null,null,null,null,null,null,null,null,null,null,null,null,null,null,null,null,null,null,null,null,null,null,null,null,null,null,null,null,null,null,null,null,null,null,null,null,null,null,null,null,null,null,null,null,null,null,null,null,null,null,null,null,null,null,null,null,null,null,null,null,null,null,null,null,null,null,null,null,null,null,null,null,null,null,null,null,null,null,null,null,null,null,null,null,null,null,null,null,null,null,null,null,null,null,null,null,null,null,null,null,null,null,null,null,null,null,null,null,null,null,null,null,null,null,null,null,null,null,null,null,null,null,null,null,null,null,null,null,null,null,null,null,null,null,null,null,null,null,null,null,null,null,null,null,null,null,null,null,null,null,null,null,null,null,null,null,null,null,null,null,null,null,null,null,null,null,null,null,null,null,null,null,null,null,null,null,null,null,null,null,null,null,null,null,null,null,null,null,null,null,null,null,null,null,null,null,null,null,null,null,null,null,null,null,null,null,null,null,null,null,null,null,null,null,null,null,null,null,null,null,null,null,null,null,null,null,null,null,null,null,null,null,null,null,null,null,null,null,null,null,null,null,null,null,null,null,null,null,null,null,null,null,null,null,null,null,null,null,null,null,null,null,null,null,null,null,null,null,null,null,null,null,null,null,null,null,null,null,null,null,null,null,null,null,null,null,null,null,null,null,null,null,null,null,null,null,null,null,null,null,null,null,null,null,null,null,null,null,null,null,null,null,null,null,null,null,null,null,null,null,null,null,null,null,null,null,null,null,null,null,null,null,null,null,null,null,null,null,null,null,null,null,null,null,null,null,null,null,null,null,null,null,null,null,null,null,null,null,null,null,null,null,null,null,null,null,null,null,null,null,null,null,null,null,null,null,null,null,null,null,null,null,null,null,null,null,null,null,null,null,null,null,null,null,null,null,null,null,null,null,null,null,null,null,null,null,null,null,null,null,null,null,null,null,null,null,null,null,null,null,null,null,null,null,null,null,null,null,null,null,null,null,null,null,null,null,null,null,null,null,null,null,null,null,null,null,null,null,null,null,null,null,null,null,null,null,null,null,null,null,null,null,null,null,null,null,null,null,null,null,null,null,null,null,null,null,null,null,null,null,null,null,null,null,null,null,null,null,null,null,null,null,null,null,null,null,null,null,null,null,null,null,null,null,null,null,null,null,null,null,null,null,null,null,null,null,null,null,null,null,null,null,null,null,null,null,null,null,null,null,null,null,null,null,null,null,null,null,null,null,null,null,null,null,null,null,null,null,null,null,null,null,null,null,null,null,null,null,null,null,null,null,null,null,null,null,null,null,null,null,null,null,null,null,null,null,null,null,null,null,null,null,null,null,null,null,null,null,null,null,null,null,null,null,null,null,null,null,null,null,null,null,null,null,null,null,null,null,null,null,null,null,null,null,null,null,null,null,null,null,null,null,null,null,null,null,null,null,null,null,null,null,null,null,null,null,null,null,null,null,null,null,null,null,null,null,null,null,null,null,null,null,null,null,null,null,null,null,null,null,null,null,null,null,null,null,null,null,null,null,null,null,null,null,null,null,null,null,null,null,null,null,null,null,null,null,null,null,null,null,null,null,null,null,null,null,null,null,null,null,null,null,null,null,null,null,null,null,null,null,null,null,null,null,null,null,null,null,null,null,null,null,null,null,null,null,null,null,null,null,null,null,null,null,null,null,null,null,null,null,null,null,null,null,null,null,null,null,null,null,null,null,null,null,null,null,null,null,null,null,null,null,null,null,null,null,null,null,null,null,null,null,null,null,null,null,null,null,null,null,null,null,null,null,null,null,null,null,null,null,null,null,null,null,null,null,null,null,null,null,null,null,null,null,null,null,null,null,null,null,null,null,null,null,null,null,null,null,null,null,null,null,null,null,null,null,null,null,null,null,null,null,null,null,null,null,null,null,null,null,null,null,null,null,null,null,null,null,null,null,null,null,null,null,null,null,null,null,null,null,null,null,null,null,null,null,null,null,null,null,null,null,null,null,null,null,null,null,null,null,null,null,null,null,null,null,null,null,null,null,null,null,null,null,null,null,null,null,null,null,null,null,null,null,null,null,null,null,null,null,null,null,null,null,null,null,null,null,null,null,null,null,null,null,null,null,null,null,null,null,null,null,null,null,null,null,null,null,null,null,null,null,null,null,null,null,null,null,null,null,null,null,null,null,null,null,null,null,null,null,null,null,null,null,null,null,null,null,null,null,null,null,null,null,null,null,null,null,null,null,null,null,null,null,null,null,null,null,null,null,null,null,null,null,null,null,null,null,null,null,null,null,null,null,null,null,null,null,null,null,null,null,null,null,null,null,null,null,null,null,null,null,null,null,null,null,null,null,null,null,null,null,null,null,null,null,null,null,null,null,null,null,null,null,null,null,null,null,null,null,null,null,null,null,null,null,null,null,null,null,null,null,null,null,null,null,null,null,null,null,null,null,null,null,null,null,null,null,null,null,null,null,null,null,null,null,null,null,null,null,null,null,null,null,null,null,null,null,null,null,null,null,null,null,null,null,null,null,null,null,null,null,null,null,null,null,null,null,null,null,null,null,null,null,null,null,null,null,null,null,null,null,null,null,null,null,null,null,null,null,null,null,null,null,null,null,null,null,null,null,null,null,null,null,null,null,null,null,null,null,null,null,null,null,null,null,null,null,null,null,null,null,null,null,null,null,null,null,null,null,null,null,null,null,null,null,null,null,null,null,null,null,null,null,null,null,null,null,null,null,null,null,null,null,null,null,null,null,null,null,null,null,null,null,null,null,null,null,null,null,null,null,null,null,null,null,null,null,null,null,null,null,null,null,null,null,null,null,null,null,null,null,null,null,null,null,null,null,null,null,null,null,null,null,null,null,null,null,null,null,null,null,null,null,null,null,null,null,null,null,null,null,null,null,null,null,null,null,null,null,null,null,null,null,null,null,null,null,null,null,null,null,null,null,null,null,null,null,null,null,null,null,null,null,null,null,null,null,null,null,null,null,null,null,null,null,null,null,null,null,null,null,null,null,null,null,null,null,null,null,null,null,null,null,null,null,null,null,null,null,null,null,null,null,null,null,null,null,null,null,null,null,null,null,null,null,null,null,null,null,null,null,null,null,null,null,null,null,null,null,null,null,null,null,null,null,null,null,null,null,null,null,null,null,null,null,null,null,null,null,null,null,null,null,null,null,null,null,null,null,null,null,null,null,null,null,null,null,null,null,null,null,null,null,null,null,null,null,null,null,null,null,null,null,null,null,null,null,null,null,null,null,null,null,null,null,null,null,null,null,null,null,null,null,null,null,null,null,null,null,null,null,null,null,null,null,null,null,null,null,null,null,null,null,null,null,null,null,null,null,null,null,null,null,null,null,null,null,null,null,null,null,null,null,null,null,null,null,null,null,null,null,null,null,null,null,null,null,null,null,null,null,null,null,null,null,null,null,null,null,null,null,null,null,null,null,null,null,null,null,null,null,null,null,null,null,null,null,null,null,null,null,null,null,null,null,null,null,null,null,null,null,null,null,null,null,null,null,null,null,null,null,null,null,null,null,null,null,null,null,null,null,null,null,null,null,null,null,null,null,null,null,null,null,null,null,null,null,null,null,null,null,null,null,null,null,null,null,null,null,null,null,null,null,null,null,null,null,null,null,null,null,null,null,null,null,null,null,null,null,null,null,null,null,null,null,null,null,null,null,null,null,null,null,null,null,null,null,null,null,null,null,null,null,null,null,null,null,null,null,null,null,null,null,null,null,null,null,null,null,null,null,null,null,null,null,null,null,null,null,null,null,null,null,null,null,null,null,null,null,null,null,null,null,null,null,null,null,null,null,null,null,null,null,null,null,null,null,null,null,null,null,null,null,null,null,null,null,null,null,null,null,null,null,null,null,null,null,null,null,null,null,null,null,null,null,null,null,null,null,null,null,null,null,null,null,null,null,null,null,null,null,null,null,null,null,null,null,null,null,null,null,null,null,null,null,null,null,null,null,null,null,null,null,null,null,null,null,null,null,null,null,null,null,null,null,null,null,null,null,null,null,null,null,null,null,null,null,null,null,null,null,null,null,null,null,null,null,null,null,null,null,null,null,null,null,null,null,null,null,null,null,null,null,null,null,null,null,null,null,null,null,null,null,null,null,null,null,null,null,null,null,null,null,null,null,null,null,null,null,null,null,null,null,null,null,null,null,null,null,null,null,null,null,null,null,null,null,null,null,null,null,null,null,null,null,null,null,null,null,null,null,null,null,null,null,null,null,null,null,null,null,null,null,null,null,null,null,null,null,null,null,null,null,null,null,null,null,null,null,null,null,null,null,null,null,null,null,null,null,null,null,null,null,null,null,null,null,null,null,null,null,null,null,null,null,null,null,null,null,null,null,null,null,null,null,null,null,null,null,null,null,null,null,null,null,null,null,null,null,null,null,null,null,null,null,null,null,null,null,null,null,null,null,null,null,null,null,null,null,null,null,null,null,null,null,null,null,null,null,null,null,null,null,null,null,null,null,null,null,null,null,null,null,null,null,null,null,null,null,null,null,null,null,null,null,null,null,null,null,null,null,null,null,null,null,null,null,null,null,null,null,null,null,null,null,null,null,null,null,null,null,null,null,null,null,null,null,null,null,null,null,null,null,null,null,null,null,null,null,null,null,null,null,null,null,null,null,null,null,null,null,null,null,null,null,null,null,null,null,null,null,null,null,null,null,null,null,null,null,null,null,null,null,null,null,null,null,null,null,null,null,null,null,null,null,null,null,null,null,null,null,null,null,null,null,null,null,null,null,null,null,null,null,null,null,null,null,null,null,null,null,null,null,null,null,null,null,null,null,null,null,null,null,null,null,null,null,null,null,null,null,null,null,null,null,null,null,null,null,null,null,null,null,null,null,null,null,null,null,null,null,null,null,null,null,null,null,null,null,null,null,null,null,null,null,null,null,null,null,null,null,null,null,null,null,null,null,null,null,null,null,null,null,null,null,null,null,null,null,null,null,null,null,null,null,null,null,null,null,null,null,null,null,null,null,null,null,null,null,null,null,null,null,null,null,null,null,null,null,null,null,null,null,null,null,null,null,null,null,null,null,null,null,null,null,null,null,null,null,null,null,null,null,null,null,null,null,null,null,null,null,null,null,null,null,null,null,null,null,null,null,null,null,null,null,null,null,null,null,null,null,null,null,null,null,null,null,null,null,null,null,null,null,null,null,null,null,null,null,null,null,null,null,null,null,null,null,null,null,null,null,null,null,null,null,null,null,null,null,null,null,null,null,null,null,null,null,null,null,null,null,null,null,null,null,null,null,null,null,null,null,null,null,null,null,null,null,null,null,null,null,null,null,null,null,null,null,null,null,null,null,null,null,null,null,null,null,null,null,null,null,null,null,null,null,null,null,null,null,null,null,null,null,null,null,null,null,null,null,null,null,null,null,null,null,null,null,null,null,null,null,null,null,null,null,null,null,null,null,null,null,null,null,null,null,null,null,null,null,null,null,null,null,null,null,null,null,null,null,null,null,null,null,null,null,null,null,null,null,null,null,null,null,null,null,null,null,null,null,null,null,null,null,null,null,null,null,null,null,null,null,null,null,null,null,null,null,null,null,null,null,null,null,null,null,null,null,null,null,null,null,null,null,null,null,null,null,null,null,null,null,null,null,null,null,null,null,null,null,null,null,null,null,null,null,null,null,null,null,null,null,null,null,null,null,null,null,null,null,null,null,null,null,null,null,null,null,null,null,null,null,null,null,null,null,null,null,null,null,null,null,null,null,null,null,null,null,null,null,null,null,null,null,null,null,null,null,null,null,null,null,null,null,null,null,null,null,null,null,null,null,null,null,null,null,null,null,null,null,null,null,null,null,null,null,null,null,null,null,null,null,null,null,null,null,null,null,null,null,null,null,null,null,null,null,null,null,null,null,null,null,null,null,null,null,null,null,null,null,null,null,null,null,null,null,null,null,null,null,null,null,null,null,null,null,null,null,null,null,null,null,null,null,null,null,null,null,null,null,null,null,null,null,null,null,null,null,null,null,null,null,null,null,null,null,null,null,null,null,null,null,null,null,null,null,null,null,null,null,null,null,null,null,null,null,null,null,null,null,null,null,null,null,null,null,null,null,null,null,null,null,null,null,null,null,null,null,null,null,null,null,null,null,null,null,null,null,null,null,null,null,null,null,null,null,null,null,null,null,null,null,null,null,null,null,null,null,null,null,null,null,null,null,null,null,null,null,null,null,null,null,null,null,null,null,null,null,null,null,null,null,null,null,null,null,null,null,null,null,null,null,null,null,null,null,null,null,null,null,null,null,null,null,null,null,null,null,null,null,null,null,null,null,null,null,null,null,null,null,null,null,null,null,null,null,null,null,null,null,null,null,null,null,null,null,null,null,null,null,null,null,null,null,null,null,null,null,null,null,null,null,null,null,null,null,null,null,null,null,null,null,null,null,null,null,null,null,null,null,null,null,null,null,null,null,null,null,null,null,null,null,null,null,null,null,null,null,null,null,null,null,null,null,null,null,null,null,null,null,null,null,null,null,null,null,null,null,null,null,null,null,null,null,null,null,null,null,null,null,null,null,null,null,null,null,null,null,null,null,null,null,null,null,null,null,null,null,null,null,null,null,null,null,null,null,null,null,null,null,null,null,null,null,null,null,null,null,null,null,null,null,null,null,null,null,null,null,null,null,null,null,null,null,null,null,null,null,null,null,null,null,null,null,null,null,null,null,null,null,null,null,null,null,null,null,null,null,null,null,null,null,null,null,null,null,null,null,null,null,null,null,null,null,null,null,null,null,null,null,null,null,null,null,null,null,null,null,null,null,null,null,null,null,null,null,null,null,null,null,null,null,null,null,null,null,null,null,null,null,null,null,null,null,null,null,null,null,null,null,null,null,null,null,null,null,null,null,null,null,null,null,null,null,null,null,null,null,null,null,null,null,null,null,null,null,null,null,null,null,null,null,null,null,null,null,null,null,null,null,null,null,null,null,null,null,null,null,null,null,null,null,null,null,null,null,null,null,null,null,null,null,null,null,null,null,null,null,null,null,null,null,null,null,null,null,null,null,null,null,null,null,null,null,null,null,null,null,null,null,null,null,null,null,null,null,null,null,null,null,null,null,null,null,null,null,null,null,null,null,null,null,null,null,null,null,null,null,null,null,null,null,null,null,null,null,null,null,null,null,null,null,null,null,null,null,null,null,null,null,null,null,null,null,null,null,null,null,null,null,null,null,null,null,null,null,null,null,null,null,null,null,null,null,null,null,null,null,null,null,null,null,null,null,null,null,null,null,null,null,null,null,null,null,null,null,null,null,null,null,null,null,null,null,null,null,null,null,null,null,null,null,null,null,null,null,null,null,null,null,null,null,null,null,null,null,null,null,null,null,null,null,null,null,null,null,null,null,null,null,null,null,null,null,null,null,null,null,null,null,null,null,null,null,null,null,null,null,null,null,null,null,null,null,null,null,null,null,null,null,null,null,null,null,null,null,null,null,null,null,null,null,null,null,null,null,null,null,null,null,null,null,null,null,null,null,null,null,null,null,null,null,null,null,null,null,null,null,null,null,null,null,null,null,null,null,null,null,null,null,null,null,null,null,null,null,null,null,null,null,null,null,null,null,null,null,null,null,null,null,null,null,null,null,null,null,null,null,null,null,null,null,null,null,null,null,null,null,null,null,null,null,null,null,null,null,null,null,null,null,null,null,null,null,null,null,null,null,null,null,null,null,null,null,null,null,null,null,null,null,null,null,null,null,null,null,null,null,null,null,null,null,null,null,null,null,null,null,null,null,null,null,null,null,null,null,null,null,null,null,null,null,null,null,null,null,null,null,null,null,null,null,null,null,null,null,null,null,null,null,null,null,null,null,null,null,null,null,null,null,null,null,null,null,null,null,null,null,null,null,null,null,null,null,null,null,null,null,null,null,null,null,null,null,null,null,null,null,null,null,null,null,null,null,null,null,null,null,null,null,null,null,null,null,null,null,null,null,null,null,null,null,null,null,null,null,null,null,null,null,null,null,null,null,null,null,null,null,null,null,null,null,null,null,null,null,null,null,null,null,null,null,null,null,null,null,null,null,null,null,null,null,null,null,null,null,null,null,null,null,null,null,null,null,null,null,null,null,null,null,null,null,null,null,null,null,null,null,null,null,null,null,null,null,null,null,null,null,null,null,null,null,null,null,null,null,null,null,null,null,null,null,null,null,null,null,null,null,null,null,null,null,null,null,null,null,null,null,null,null,null,null,null,null,null,null,null,null,null,null,null,null,null,null,null,null,null,null,null,null,null,null,null,null,null,null,null,null,null,null,null,null,null,null,null,null,null,null,null,null,null,null,null,null,null,null,null,null,null,null,null,null,null,null,null,null,null,null,null,null,null,null,null,null,null,null,null,null,null,null,null,null,null,null,null,null,null,null,null,null,null,null,null,null,null,null,null,null,null,null,null,null,null,null,null,null,null,null,null,null,null,null,null,null,null,null,null,null,null,null,null,null,null,null,null,null,null,null,null,null,null,null,null,null,null,null,null,null,null,null,null,null,null,null,null,null,null,null,null,null,null,null,null,null,null,null,null,null,null,null,null,null,null,null,null,null,null,null,null,null,null,null,null,null,null,null,null,null,null,null,null,null,null,null,null,null,null,null,null,null,null,null,null,null,null,null,null,null,null,null,null,null,null,null,null,null,null,null,null,null,null,null,null,null,null,null,null,null,null,null,null,null,null,null,null,null,null,null,null,null,null,null,null,null,null,null,null,null,null,null,null,null,null,null,null,null,null,null,null,null,null,null,null,null,null,null,null,null,null,null,null,null,null,null,null,null,null,null,null,null,null,null,null,null,null,null,null,null,null,null,null,null,null,null,null,null,null,null,null,null,null,null,null,null,null,null,null,null,null,null,null,null,null,null,null,null,null,null,null,null,null,null,null,null,null,null,null,null,null,null,null,null,null,null,null,null,null,null,null,null,null,null,null,null,null,null,null,null,null,null,null,null,null,null,null,null,null,null,null,null,null,null,null,null,null,null,null,null,null,null,null,null,null,null,null,null,null,null,null,null,null,null,null,null,null,null,null,null,null,null,null,null,null,null,null,null,null,null,null,null,null,null,null,null,null,null,null,null,null,null,null,null,null,null,null,null,null,null,null,null,null,null,null,null,null,null,null,null,null,null,null,null,null,null,null,null,null,null,null,null,null,null,null,null,null,null,null,null,null,null,null,null,null,null,null,null,null,null,null,null,null,null,null,null,null,null,null,null,null,null,null,null,null,null,null,null,null,null,null,null,null,null,null,null,null,null,null,null,null,null,null,null,null,null,null,null,null,null,null,null,null,null,null,null,null,null,null,null,null,null,null,null,null,null,null,null,null,null,null,null,null,null,null,null,null,null,null,null,null,null,null,null,null,null,null,null,null,null,null,null,null,null,null,null,null,null,null,null,null,null,null,null,null,null,null,null,null,null,null,null,null,null,null,null,null,null,null,null,null,null,null,null,null,null,null,null,null,null,null,null,null,null,null,null,null,null,null,null,null,null,null,null,null,null,null,null,null,null,null,null,null,null,null,null,null,null,null,null,null,null,null,null,null,null,null,null,null,null,null,null,null,null,null,null,null,null,null,null,null,null,null,null,null,null,null,null,null,null,null,null,null,null,null,null,null,null,null,null,null,null,null,null,null,null,null,null,null,null,null,null,null,null,null,null,null,null,null,null,null,null,null,null,null,null,null,null,null,null,null,null,null,null,null,null,null,null,null,null,null,null,null,null,null,null,null,null,null,null,null,null,null,null,null,null,null,null,null,null,null,null,null,null,null,null,null,null,null,null,null,null,null,null,null,null,null,null,null,null,null,null,null,null,null,null,null,null,null,null,null,null,null,null,null,null,null,null,null,null,null,null,null,null,null,null,null,null,null,null,null,null,null,null,null,null,null,null,null,null,null,null,null,null,null,null,null,null,null,null,null,null,null,null,null,null,null,null,null,null,null,null,null,null,null,null,null,null,null,null,null,null,null,null,null,null,null,null,null,null,null,null,null,null,null,null,null,null,null,null,null,null,null,null,null,null,null,null,null,null,null,null,null,null,null,null,null,null,null,null,null,null,null,null,null,null,null,null,null,null,null,null,null,null,null,null,null,null,null,null,null,null,null,null,null,null,null,null,null,null,null,null,null,null,null,null,null,null,null,null,null,null,null,null,null,null,null,null,null,null,null,null,null,null,null,null,null,null,null,null,null,null,null,null,null,null,null,null,null,null,null,null,null,null,null,null,null,null,null,null,null,null,null,null,null,null,null,null,null,null,null,null,null,null,null,null,null,null,null,null,null,null,null,null,null,null,null,null,null,null,null,null,null,null,null,null,null,null,null,null,null,null,null,null,null,null,null,null,null,null,null,null,null,null,null,null,null,null,null,null,null,null,null,null,null,null,null,null,null,null,null,null,null,null,null,null,null,null,null,null,null,null,null,null,null,null,null,null,null,null,null,null,null,null,null,null,null,null,null,null,null,null,null,null,null,null,null,null,null,null,null,null,null,null,null,null,null,null,null,null,null,null,null,null,null,null,null,null,null,null,null,null,null,null,null,null,null,null,null,null,null,null,null,null,null,null,null,null,null,null,null,null,null,null,null,null,null,null,null,null,null,null,null,null,null,null,null,null,null,null,null,null,null,null,null,null,null,null,null,null,null,null,null,null,null,null,null,null,null,null,null,null,null,null,null,null,null,null,null,null,null,null,null,null,null,null,null,null,null,null,null,null,null,null,null,null,null,null,null,null,null,null,null,null,null,null,null,null,null,null,null,null,null,null,null,null,null,null,null,null,null,null,null,null,null,null,null,null,null,null,null,null,null,null,null,null,null,null,null,null,null,null,null,null,null,null,null,null,null,null,null,null,null,null,null,null,null,null,null,null,null,null,null,null,null,null,null,null,null,null,null,null,null,null,null,null,null,null,null,null,null,null,null,null,null,null,null,null,null,null,null,null,null,null,null,null,null,null,null,null,null,null,null,null,null,null,null,null,null,null,null,null,null,null,null,null,null,null,null,null,null,null,null,null,null,null,null,null,null,null,null,null,null,null,null,null,null,null,null,null,null,null,null,null,null,null,null,null,null,null,null,null,null,null,null,null,null,null,null,null,null,null,null,null,null,null,null,null,null,null,null,null,null,null,null,null,null,null,null,null,null,null,null,null,null,null,null,null,null,null,null,null,null,null,null,null,null,null,null,null,null,null,null,null,null,null,null,null,null,null,null,null,null,null,null,null,null,null,null,null,null,null,null,null,null,null,null,null,null,null,null,null,null,null,null,null,null,null,null,null,null,null,null,null,null,null,null,null,null,null,null,null,null,null,null,null,null,null,null,null,null,null,null,null,null,null,null,null,null,null,null,null,null,null,null,null,null,null,null,null,null,null,null,null,null,null,null,null,null,null,null,null,null,null,null,null,null,null,null,null,null,null,null,null,null,null,null,null,null,null,null,null,null,null,null,null,null,null,null,null,null,null,null,null,null,null,null,null,null,null,null,null,null,null,null,null,null,null,null,null,null,null,null,null,null,null,null,null,null,null,null,null,null,null,null,null,null,null,null,null,null,null,null,null,null,null,null,null,null,null,null,null,null,null,null,null,null,null,null,null,null,null,null,null,null,null,null,null,null,null,null,null,null,null,null,null,null,null,null,null,null,null,null,null,null,null,null,null,null,null,null,null,null,null,null,null,null,null,null,null,null,null,null,null,null,null,null,null,null,null,null,null,null,null,null,null,null,null,null,null,null,null,null,null,null,null,null,null,null,null,null,null,null,null,null,null,null,null,null,null,null,null,null,null,null,null,null,null,null,null,null,null,null,null,null,null,null,null,null,null,null,null,null,null,null,null,null,null,null,null,null,null,null,null,null,null,null,null,null,null,null,null,null,null,null,null,null,null,null,null,null,null,null,null,null,null,null,null,null,null,null,null,null,null,null,null,null,null,null,null,null,null,null,null,null,null,null,null,null,null,null,null,null,null,null,null,null,null,null,null,null,null,null,null,null,null,null,null,null,null,null,null,null,null,null,null,null,null,null,null,null,null,null,null,null,null,null,null,null,null,null,null,null,null,null,null,null,null,null,null,null,null,null,null,null,null,null,null,null,null,null,null,null,null,null,null,null,null,null,null,null,null,null,null,null,null,null,null,null,null,null,null,null,null,null,null,null,null,null,null,null,null,null,null,null,null,null,null,null,null,null,null,null,null,null,null,null,null,null,null,null,null,null,null,null,null,null,null,null,null,null,null,null,null,null,null,null,null,null,null,null,null,null,null,null,null,null,null,null,null,null,null,null,null,null,null,null,null,null,null,null,null,null,null,null,null,null,null,null,null,null,null,null,null,null,null,null,null,null,null,null,null,null,null,null,null,null,null,null,null,null,null,null,null,null,null,null,null,null,null,null,null,null,null,null,null,null,null,null,null,null,null,null,null,null,null,null,null,null,null,null,null,null,null,null,null,null,null,null,null,null,null,null,null,null,null,null,null,null,null,null,null,null,null,null,null,null,null,null,null,null,null,null,null,null,null,null,null,null,null,null,null,null,null,null,null,null,null,null,null,null,null,null,null,null,null,null,null,null,null,null,null,null,null,null,null,null,null,null,null,null,null,null,null,null,null,null,null,null,null,null,null,null,null,null,null,null,null,null,null,null,null,null,null,null,null,null,null,null,null,null,null,null,null,null,null,null,null,null,null,null,null,null,null,null,null,null,null,null,null,null,null,null,null,null,null,null,null,null,null,null,null,null,null,null,null,null,null,null,null,null,null,null,null,null,null,null,null,null,null,null,null,null,null,null,null,null,null,null,null,null,null,null,null,null,null,null,null,null,null,null,null,null,null,null,null,null,null,null,null,null,null,null,null,null,null,null,null,null,null,null,null,null,null,null,null,null,null,null,null,null,null,null,null,null,null,null,null,null,null,null,null,null,null,null,null,null,null,null,null,null,null,null,null,null,null,null,null,null,null,null,null,null,null,null,null,null,null,null,null,null,null,null,null,null,null,null,null,null,null,null,null,null,null,null,null,null,null,null,null,null,null,null,null,null,null,null,null,null,null,null,null,null,null,null,null,null,null,null,null,null,null,null,null,null,null,null,null,null,null,null,null,null,null,null,null,null,null,null,null,null,null,null,null,null,null,null,null,null,null,null,null,null,null,null,null,null,null,null,null,null,null,null,null,null,null,null,null,null,null,null,null,null,null,null,null,null,null,null,null,null,null,null,null,null,null,null,null,null,null,null,null,null,null,null,null,null,null,null,null,null,null,null,null,null,null,null,null,null,null,null,null,null,null,null,null,null,null,null,null,null,null,null,null,null,null,null,null,null,null,null,null,null,null,null,null,null,null,null,null,null,null,null,null,null,null,null,null,null,null,null,null,null,null,null,null,null,null,null,null,null,null,null,null,null,null,null,null,null,null,null,null,null,null,null,null,null,null,null,null,null,null,null,null,null,null,null,null,null,null,null,null,null,null,null,null,null,null,null,null,null,null,null,null,null,null,null,null,null,null,null,null,null,null,null,null,null,null,null,null,null,null,null,null,null,null,null,null,null,null,null,null,null,null,null,null,null,null,null,null,null,null,null,null,null,null,null,null,null,null,null,null,null,null,null,null,null,null,null,null,null,null,null,null,null,null,null,null,null,null,null,null,null,null,null,null,null,null,null,null,null,null,null,null,null,null,null,null,null,null,null,null,null,null,null,null,null,null,null,null,null,null,null,null,null,null,null,null,null,null,null,null,null,null,null,null,null,null,null,null,null,null,null,null,null,null,null,null,null,null,null,null,null,null,null,null,null,null,null,null,null,null,null,null,null,null,null,null,null,null,null,null,null,null,null,null,null,null,null,null,null,null,null,null,null,null,null,null,null,null,null,null,null,null,null,null,null,null,null,null,null,null,null,null,null,null,null,null,null,null,null,null,null,null,null,null,null,null,null,null,null,null,null,null,null,null,null,null,null,null,null,null,null,null,null,null,null,null,null,null,null,null,null,null,null,null,null,null,null,null,null,null,null,null,null,null,null,null,null,null,null,null,null,null,null,null,null,null,null,null,null,null,null,null,null,null,null,null,null,null,null,null,null,null,null,null,null,null,null,null,null,null,null,null,null,null,null,null,null,null,null,null,null,null,null,null,null,null,null,null,null,null,null,null,null,null,null,null,null,null,null,null,null,null,null,null,null,null,null,null,null,null,null,null,null,null,null,null,null,null,null,null,null,null,null,null,null,null,null,null,null,null,null,null,null,null,null,null,null,null,null,null,null,null,null,null,null,null,null,null,null,null,null,null,null,null,null,null,null,null,null,null,null,null,null,null,null,null,null,null,null,null,null,null,null,null,null,null,null,null,null,null,null,null,null,null,null,null,null,null,null,null,null,null,null,null,null,null,null,null,null,null,null,null,null,null,null,null,null,null,null,null,null,null,null,null,null,null,null,null,null,null,null,null,null,null,null,null,null,null,null,null,null,null,null,null,null,null,null,null,null,null,null,null,null,null,null,null,null,null,null,null,null,null,null,null,null,null,null,null,null,null,null,null,null,null,null,null,null,null,null,null,null,null,null,null,null,null,null,null,null,null,null,null,null,null,null,null,null,null,null,null,null,null,null,null,null,null,null,null,null,null,null,null,null,null,null,null,null,null,null,null,null,null,null,null,null,null,null,null,null,null,null,null,null,null,null,null,null,null,null,null,null,null,null,null,null,null,null,null,null,null,null,null,null,null,null,null,null,null,null,null,null,null,null,null,null,null,null,null,null,null,null,null,null,null,null,null,null,null,null,null,null,null,null,null,null,null,null,null,null,null,null,null,null,null,null,null,null,null,null,null,null,null,null,null,null,null,null,null,null,null,null,null,null,null,null,null,null,null,null,null,null,null,null,null,null,null,null,null,null,null,null,null,null,null,null,null,null,null,null,null,null,null,null,null,null,null,null,null,null,null,null,null,null,null,null,null,null,null,null,null,null,null,null,null,null,null,null,null,null,null,null,null,null,null,null,null,null,null,null,null,null,null,null,null,null,null,null,null,null,null,null,null,null,null,null,null,null,null,null,null,null,null,null,null,null,null,null,null,null,null,null,null,null,null,null,null,null,null,null,null,null,null,null,null,null,null,null,null,null,null,null,null,null,null,null,null,null,null,null,null,null,null,null,null,null,null,null,null,null,null,null,null,null,null,null,null,null,null,null,null,null,null,null,null,null,null,null,null,null,null,null,null,null,null,null,null,null,null,null,null,null,null,null,null,null,null,null,null,null,null,null,null,null,null,null,null,null,null,null,null,null,null,null,null,null,null,null,null,null,null,null,null,null,null,null,null,null,null,null,null,null,null,null,null,null,null,null,null,null,null,null,null,null,null,null,null,null,null,null,null,null,null,null,null,null,null,null,null,null,null,null,null,null,null,null,null,null,null,null,null,null,null,null,null,null,null,null,null,null,null,null,null,null,null,null,null,null,null,null,null,null,null,null,null,null,null,null,null,null,null,null,null,null,null,null,null,null,null,null,null,null,null,null,null,null,null,null,null,null,null,null,null,null,null,null,null,null,null,null,null,null,null,null,null,null,null,null,null,null,null,null,null,null,null,null,null,null,null,null,null,null,null,null,null,null,null,null,null,null,null,null,null,null,null,null,null,null,null,null,null,null,null,null,null,null,null,null,null,null,null,null,null,null,null,null,null,null,null,null,null,null,null,null,null,null,null,null,null,null,null,null,null,null,null,null,null,null,null,null,null,null,null,null,null,null,null,null,null,null,null,null,null,null,null,null,null,null,null,null,null,null,null,null,null,null,null,null,null,null,null,null,null,null,null,null,null,null,null,null,null,null,null,null,null,null,null,null,null,null,null,null,null,null,null,null,null,null,null,null,null,null,null,null,null,null,null,null,null,null,null,null,null,null,null,null,null,null,null,null,null,null,null,null,null,null,null,null,null,null,null,null,null,null,null,null,null,null,null,null,null,null,null,null,null,null,null,null,null,null,null,null,null,null,null,null,null,null,null,null,null,null,null,null,null,null,null,null,null,null,null,null,null,null,null,null,null,null,null,null,null,null,null,null,null,null,null,null,null,null,null,null,null,null,null,null,null,null,null,null,null,null,null,null,null,null,null,null,null,null,null,null,null,null,null,null,null,null,null,null,null,null,null,null,null,null,null,null,null,null,null,null,null,null,null,null,null,null,null,null,null,null,null,null,null,null,null,null,null,null,null,null,null,null,null,null,null,null,null,null,null,null,null,null,null,null,null,null,null,null,null,null,null,null,null,null,null,null,null,null,null,null,null,null,null,null,null,null,null,null,null,null,null,null,null,null,null,null,null,null,null,null,null,null,null,null,null,null,null,null,null,null,null,null,null,null,null,null,null,null,null,null,null,null,null,null,null,null,null,null,null,null,null,null,null,null,null,null,null,null,null,null,null,null,null,null,null,null,null,null,null,null,null,null,null,null,null,null,null,null,null,null,null,null,null,null,null,null,null,null,null,null,null,null,null,null,null,null,null,null,null,null,null,null,null,null,null,null,null,null,null,null,null,null,null,null,null,null,null,null,null,null,null,null,null,null,null,null,null,null,null,null,null,null,null,null,null,null,null,null,null,null,null,null,null,null,null,null,null,null,null,null,null,null,null,null,null,null,null,null,null,null,null,null,null,null,null,null,null,null,null,null,null,null,null,null,null,null,null,null,null,null,null,null,null,null,null,null,null,null,null,null,null,null,null,null,null,null,null,null,null,null,null,null,null,null,null,null,null,null,null,null,null,null,null,null,null,null,null,null,null,null,null,null,null,null,null,null,null,null,null,null,null,null,null,null,null,null,null,null,null,null,null,null,null,null,null,null,null,null,null,null,null,null,null,null,null,null,null,null,null,null,null,null,null,null,null,null,null,null,null,null,null,null,null,null,null,null,null,null,null,null,null,null,null,null,null,null,null,null,null,null,null,null,null,null,null,null,null,null,null,null,null,null,null,null,null,null,null,null,null,null,null,null,null,null,null,null,null,null,null,null,null,null,null,null,null,null,null,null,null,null,null,null,null,null,null,null,null,null,null,null,null,null,null,null,null,null,null,null,null,null,null,null,null,null,null,null,null,null,null,null,null,null,null,null,null,null,null,null,null,null,null,null,null,null,null,null,null,null,null,null,null,null,null,null,null,null,null,null,null,null,null,null,null,null,null,null,null,null,null,null,null,null,null,null,null,null,null,null,null,null,null,null,null,null,null,null,null,null,null,null,null,null,null,null,null,null,null,null,null,null,null,null,null,null,null,null,null,null,null,null,null,null,null,null,null,null,null,null,null,null,null,null,null,null,null,null,null,null,null,null,null,null,null,null,null,null,null,null,null,null,null,null,null,null,null,null,null,null,null,null,null,null,null,null,null,null,null,null,null,null,null,null,null,null,null,null,null,null,null,null,null,null,null,null,null,null,null,null,null,null,null,null,null,null,null,null,null,null,null,null,null,null,null,null,null,null,null,null,null,null,null,null,null,null,null,null,null,null,null,null,null,null,null,null,null,null,null,null,null,null,null,null,null,null,null,null,null,null,null,null,null,null,null,null,null,null,null,null,null,null,null,null,null,null,null,null,null,null,null,null,null,null,null,null,null,null,null,null,null,null,null,null,null,null,null,null,null,null,null,null,null,null,null,null,null,null,null,null,null,null,null,null,null,null,null,null,null,null,null,null,null,null,null,null,null,null,null,null,null,null,null,null,null,null,null,null,null,null,null,null,null,null,null,null,null,null,null,null,null,null,null,null,null,null,null,null,null,null,null,null,null,null,null,null,null,null,null,null,null,null,null,null,null,null,null,null,null,null,null,null,null,null,null,null,null,null,null,null,null,null,null,null,null,null,null,null,null,null,null,null,null,null,null,null,null,null,null,null,null,null,null,null,null,null,null,null,null,null,null,null,null,null,null,null,null,null,null,null,null,null,null,null,null,null,null,null,null,null,null,null,null,null,null,null,null,null,null,null,null,null,null,null,null,null,null,null,null,null,null,null,null,null,null,null,null,null,null,null,null,null,null,null,null,null,null,null,null,null,null,null,null,null,null,null,null,null,null,null,null,null,null,null,null,null,null,null,null,null,null,null,null,null,null,null,null,null,null,null,null,null,null,null,null,null,null,null,null,null,null,null,null,null,null,null,null,null,null,null,null,null,null,null,null,null,null,null,null,null,null,null,null,null,null,null,null,null,null,null,null,null,null,null,null,null,null,null,null,null,null,null,null,null,null,null,null,null,null,null,null,null,null,null,null,null,null,null,null,null,null,null,null,null,null,null,null,null,null,null,null,null,null,null,null,null,null,null,null,null,null,null,null,null,null,null,null,null,null,null,null,null,null,null,null,null,null,null,null,null,null,null,null,null,null,null,null,null,null,null,null,null,null,null,null,null,null,null,null,null,null,null,null,null,null,null,null,null,null,null,null,null,null,null,null,null,null,null,null,null,null,null,null,null,null,null,null,null,null,null,null,null,null,null,null,null,null,null,null,null,null,null,null,null,null,null,null,null,null,null,null,null,null,null,null,null,null,null,null,null,null,null,null,null,null,null,null,null,null,null,null,null,null,null,null,null,null,null,null,null,null,null,null,null,null,null,null,null,null,null,null,null,null,null,null,null,null,null,null,null,null,null,null,null,null,null,null,null,null,null,null,null,null,null,null,null,null,null,null,null,null,null,null,null,null,null,null,null,null,null,null,null,null,null,null,null,null,null,null,null,null,null,null,null,null,null,null,null,null,null,null,null,null,null,null,null,null,null,null,null,null,null,null,null,null,null,null,null,null,null,null,null,null,null,null,null,null,null,null,null,null,null,null,null,null,null,null,null,null,null,null,null,null,null,null,null,null,null,null,null,null,null,null,null,null,null,null,null,null,null,null,null,null,null,null,null,null,null,null,null,null,null,null,null,null,null,null,null,null,null,null,null,null,null,null,null,null,null,null,null,null,null,null,null,null,null,null,null,null,null,null,null,null,null,null,null,null,null,null,null,null,null,null,null,null,null,null,null,null,null,null,null,null,null,null,null,null,null,null,null,null,null,null,null,null,null,null,null,null,null,null,null,null,null,null,null,null,null,null,null,null,null,null,null,null,null,null,null,null,null,null,null,null,null,null,null,null,null,null,null,null,null,null,null,null,null,null,null,null,null,null,null,null,null,null,null,null,null,null,null,null,null,null,null,null,null,null,null,null,null,null,null,null,null,null,null,null,null,null,null,null,null,null,null,null,null,null,null,null,null,null,null,null,null,null,null,null,null,null,null,null,null,null,null,null,null,null,null,null,null,null,null,null,null,null,null,null,null,null,null,null,null,null,null,null,null,null,null,null,null,null,null,null,null,null,null,null,null,null,null,null,null,null,null,null,null,null,null,null,null,null,null,null,null,null,null,null,null,null,null,null,null,null,null,null,null,null,null,null,null,null,null,null,null,null,null,null,null,null,null,null,null,null,null,null,null,null,null,null,null,null,null,null,null,null,null,null,null,null,null,null,null,null,null,null,null,null,null,null,null,null,null,null,null,null,null,null,null,null,null,null,null,null,null,null,null,null,null,null,null,null,null,null,null,null,null,null,null,null,null,null,null,null,null,null,null,null,null,null,null,null,null,null,null,null,null,null,null,null,null,null,null,null,null,null,null,null,null,null,null,null,null,null,null,null,null,null,null,null,null,null,null,null,null,null,null,null,null,null,null,null,null,null,null,null,null,null,null,null,null,null,null,null,null,null,null,null,null,null,null,null,null,null,null,null,null,null,null,null,null,null,null,null,null,null,null,null,null,null,null,null,null,null,null,null,null,null,null,null,null,null,null,null,null,null,null,null,null,null,null,null,null,null,null,null,null,null,null,null,null,null,null,null,null,null,null,null,null,null,null,null,null,null,null,null,null,null,null,null,null,null,null,null,null,null,null,null,null,null,null,null,null,null,null,null,null,null,null,null,null,null,null,null,null,null,null,null,null,null,null,null,null,null,null,null,null,null,null,null,null,null,null,null,null,null,null,null,null,null,null,null,null,null,null,null,null,null,null,null,null,null,null,null,null,null,null,null,null,null,null,null,null,null,null,null,null,null,null,null,null,null,null,null,null,null,null,null,null,null,null,null,null,null,null,null,null,null,null,null,null,null,null,null,null,null,null,null,null,null,null,null,null,null,null,null,null,null,null,null,null,null,null,null,null,null,null,null,null,null,null,null,null,null,null,null,null,null,null,null,null,null,null,null,null,null,null,null,null,null,null,null,null,null,null,null,null,null,null,null,null,null,null,null,null,null,null,null,null,null,null,null,null,null,null,null,null,null,null,null,null,null,null,null,null,null,null,null,null,null,null,null,null,null,null,null,null,null,null,null,null,null,null,null,null,null,null,null,null,null,null,null,null,null,null,null,null,null,null,null,null,null,null,null,null,null,null,null,null,null,null,null,null,null,null,null,null,null,null,null,null,null,null,null,null,null,null,null,null,null,null,null,null,null,null,null,null,null,null,null,null,null,null,null,null,null,null,null,null,null,null,null,null,null,null,null,null,null,null,null,null,null,null,null,null,null,null,null,null,null,null,null,null,null,null,null,null,null,null,null,null,null,null,null,null,null,null,null,null,null,null,null,null,null,null,null,null,null,null,null,null,null,null,null,null,null,null,null,null,null,null,null,null,null,null,null,null,null,null,null,null,null,null,null,null,null,null,null,null,null,null,null,null,null,null,null,null,null,null,null,null,null,null,null,null,null,null,null,null,null,null,null,null,null,null,null,null,null,null,null,null,null,null,null,null,null,null,null,null,null,null,null,null,null,null,null,null,null,null,null,null,null,null,null,null,null,null,null,null,null,null,null,null,null,null,null,null,null,null,null,null,null,null,null,null,null,null,null,null,null,null,null,null,null,null,null,null,null,null,null,null,null,null,null,null,null,null,null,null,null,null,null,null,null,null,null,null,null,null,null,null,null,null,null,null,null,null,null,null,null,null,null,null,null,null,null,null,null,null,null,null,null,null,null,null,null,null,null,null,null,null,null,null,null,null,null,null,null,null,null,null,null,null,null,null,null,null,null,null,null,null,null,null,null,null,null,null,null,null,null,null,null,null,null,null,null,null,null,null,null,null,null,null,null,null,null,null,null,null,null,null,null,null,null,null,null,null,null,null,null,null,null,null,null,null,null,null,null,null,null,null,null,null,null,null,null,null,null,null,null,null,null,null,null,null,null,null,null,null,null,null,null,null,null,null,null,null,null,null,null,null,null,null,null,null,null,null,null,null,null,null,null,null,null,null,null,null,null,null,null,null,null,null,null,null,null,null,null,null,null,null,null,null,null,null,null,null,null,null,null,null,null,null,null,null,null,null,null,null,null,null,null,null,null,null,null,null,null,null,null,null,null,null,null,null,null,null,null,null,null,null,null,null,null,null,null,null,null,null,null,null,null,null,null,null,null,null,null,null,null,null,null,null,null,null,null,null,null,null,null,null,null,null,null,null,null,null,null,null,null,null,null,null,null,null,null,null,null,null,null,null,null,null,null,null,null,null,null,null,null,null,null,null,null,null,null,null,null,null,null,null,null,null,null,null,null,null,null,null,null,null,null,null,null,null,null,null,null,null,null,null,null,null,null,null,null,null,null,null,null,null,null,null,null,null,null,null,null,null,null,null,null,null,null,null,null,null,null,null,null,null,null,null,null,null,null,null,null,null,null,null,null,null,null,null,null,null,null,null,null,null,null,null,null,null,null,null,null,null,null,null,null,null,null,null,null,null,null,null,null,null,null,null,null,null,null,null,null,null,null,null,null,null,null,null,null,null,null,null,null,null,null,null,null,null,null,null,null,null,null,null,null,null,null,null,null,null,null,null,null,null,null,null,null,null,null,null,null,null,null,null,null,null,null,null,null,null,null,null,null,null,null,null,null,null,null,null,null,null,null,null,null,null,null,null,null,null,null,null,null,null,null,null,null,null,null,null,null,null,null,null,null,null,null,null,null,null,null,null,null,null,null,null,null,null,null,null,null,null,null,null,null,null,null,null,null,null,null,null,null,null,null,null,null,null,null,null,null,null,null,null,null,null,null,null,null,null,null,null,null,null,null,null,null,null,null,null,null,null,null,null,null,null,null,null,null,null,null,null,null,null,null,null,null,null,null,null,null,null,null,null,null,null,null,null,null,null,null,null,null,null,null,null,null,null,null,null,null,null,null,null,null,null,null,null,null,null,null,null,null,null,null,null,null,null,null,null,null,null,null,null,null,null,null,null,null,null,null,null,null,null,null,null,null,null,null,null,null,null,null,null,null,null,null,null,null,null,null,null,null,null,null,null,null,null,null,null,null,null,null,null,null,null,null,null,null,null,null,null,null,null,null,null,null,null,null,null,null,null,null,null,null,null,null,null,null,null,null,null,null,null,null,null,null,null,null,null,null,null,null,null,null,null,null,null,null,null,null,null,null,null,null,null,null,null,null,null,null,null,null,null,null,null,null,null,null,null,null,null,null,null,null,null,null,null,null,null,null,null,null,null,null,null,null,null,null,null,null,null,null,null,null,null,null,null,null,null,null,null,null,null,null,null,null,null,null,null,null,null,null,null,null,null,null,null,null,null,null,null,null,null,null,null,null,null,null,null,null,null,null,null,null,null,null,null,null,null,null,null,null,null,null,null,null,null,null,null,null,null,null,null,null,null,null,null,null,null,null,null,null,null,null,null,null,null,null,null,null,null,null,null,null,null,null,null,null,null,null,null,null,null,null,null,null,null,null,null,null,null,null,null,null,null,null,null,null,null,null,null,null,null,null,null,null,null,null,null,null,null,null,null,null,null,null,null,null,null,null,null,null,null,null,null,null,null,null,null,null,null,null,null,null,null,null,null,null,null,null,null,null,null,null,null,null,null,null,null,null,null,null,null,null,null,null,null,null,null,null,null,null,null,null,null,null,null,null,null,null,null,null,null,null,null,null,null,null,null,null,null,null,null,null,null,null,null,null,null,null,null,null,null,null,null,null,null,null,null,null,null,null,null,null,null,null,null,null,null,null,null,null,null,null,null,null,null,null,null,null,null,null,null,null,null,null,null,null,null,null,null,null,null,null,null,null,null,null,null,null,null,null,null,null,null,null,null,null,null,null,null,null,null,null,null,null,null,null,null,null,null,null,null,null,null,null,null,null,null,null,null,null,null,null,null,null,null,null,null,null,null,null,null,null,null,null,null,null,null,null,null,null,null,null,null,null,null,null,null,null,null,null,null,null,null,null,null,null,null,null,null,null,null,null,null,null,null,null,null,null,null,null,null,null,null,null,null,null,null,null,null,null,null,null,null,null,null,null,null,null,null,null,null,null,null,null,null,null,null,null,null,null,null,null,null,null,null,null,null,null,null,null,null,null,null,null,null,null,null,null,null,null,null,null,null,null,null,null,null,null,null,null,null,null,null,null,null,null,null,null,null,null,null,null,null,null,null,null,null,null,null,null,null,null,null,null,null,null,null,null,null,null,null,null,null,null,null,null,null,null,null,null,null,null,null,null,null,null,null,null,null,null,null,null,null,null,null,null,null,null,null,null,null,null,null,null,null,null,null,null,null,null,null,null,null,null,null,null,null,null,null,null,null,null,null,null,null,null,null,null,null,null,null,null,null,null,null,null,null,null,null,null,null,null,null,null,null,null,null,null,null,null,null,null,null,null,null,null,null,null,null,null,null,null,null,null,null,null,null,null,null,null,null,null,null,null,null,null,null,null,null,null,null,null,null,null,null,null,null,null,null,null,null,null,null,null,null,null,null,null,null,null,null,null,null,null,null,null,null,null,null,null,null,null,null,null,null,null,null,null,null,null,null,null,null,null,null,null,null,null,null,null,null,null,null,null,null,null,null,null,null,null,null,null,null,null,null,null,null,null,null,null,null,null,null,null,null,null,null,null,null,null,null,null,null,null,null,null,null,null,null,null,null,null,null,null,null,null,null,null,null,null,null,null,null,null,null,null,null,null,null,null,null,null,null,null,null,null,null,null,null,null,null,null,null,null,null,null,null,null,null,null,null,null,null,null,null,null,null,null,null,null,null,null,null,null,null,null,null,null,null,null,null,null,null,null,null,null,null,null,null,null,null,null,null,null,null,null,null,null,null,null,null,null,null,null,null,null,null,null,null,null,null,null,null,null,null,null,null,null,null,null,null,null,null,null,null,null,null,null,null,null,null,null,null,null,null,null,null,null,null,null,null,null,null,null,null,null,null,null,null,null,null,null,null,null,null,null,null,null,null,null,null,null,null,null,null,null,null,null,null,null,null,null,null,null,null,null,null,null,null,null,null,null,null,null,null,null,null,null,null,null,null,null,null,null,null,null,null,null,null,null,null,null,null,null,null,null,null,null,null,null,null,null,null,null,null,null,null,null,null,null,null,null,null,null,null,null,null,null,null,null,null,null,null,null,null,null,null,null,null,null,null,null,null,null,null,null,null,null,null,null,null,null,null,null,null,null,null,null,null,null,null,null,null,null,null,null,null,null,null,null,null,null,null,null,null,null,null,null,null,null,null,null,null,null,null,null,null,null,null,null,null,null,null,null,null,null,null,null,null,null,null,null,null,null,null,null,null,null,null,null,null,null,null,null,null,null,null,null,null,null,null,null,null,null,null,null,null,null,null,null,null,null,null,null,null,null,null,null,null,null,null,null,null,null,null,null,null,null,null,null,null,null,null,null,null,null,null,null,null,null,null,null,null,null,null,null,null,null,null,null,null,null,null,null,null,null,null,null,null,null,null,null,null,null,null,null,null,null,null,null,null,null,null,null,null,null,null,null,null,null,null,null,null,null,null,null,null,null,null,null,null,null,null,null,null,null,null,null,null,null,null,null,null,null,null,null,null,null,null,null,null,null,null,null,null,null,null,null,null,null,null,null,null,null,null,null,null,null,null,null,null,null,null,null,null,null,null,null,null,null,null,null,null,null,null,null,null,null,null,null,null,null,null,null,null,null,null,null,null,null,null,null,null,null,null,null,null,null,null,null,null,null,null,null,null,null,null,null,null,null,null,null,null,null,null,null,null,null,null,null,null,null,null,null,null,null,null,null,null,null,null,null,null,null,null,null,null,null,null,null,null,null,null,null,null,null,null,null,null,null,null,null,null,null,null,null,null,null,null,null,null,null,null,null,null,null,null,null,null,null,null,null,null,null,null,null,null,null,null,null,null,null,null,null,null,null,null,null,null,null,null,null,null,null,null,null,null,null,null,null,null,null,null,null,null,null,null,null,null,null,null,null,null,null,null,null,null,null,null,null,null,null,null,null,null,null,null,null,null,null,null,null,null,null,null,null,null,null,null,null,null,null,null,null,null,null,null,null,null,null,null,null,null,null,null,null,null,null,null,null,null,null,null,null,null,null,null,null,null,null,null,null,null,null,null,null,null,null,null,null,null,null,null,null,null,null,null,null,null,null,null,null,null,null,null,null,null,null,null,null,null,null,null,null,null,null,null,null,null,null,null,null,null,null,null,null,null,null,null,null,null,null,null,null,null,null,null,null,null,null,null,null,null,null,null,null,null,null,null,null,null,null,null,null,null,null,null,null,null,null,null,null,null,null,null,null,null,null,null,null,null,null,null,null,null,null,null,null,null,null,null,null,null,null,null,null,null,null,null,null,null,null,null,null,null,null,null,null,null,null,null,null,null,null,null,null,null,null,null,null,null,null,null,null,null,null,null,null,null,null,null,null,null,null,null,null,null,null,null,null,null,null,null,null,null,null,null,null,null,null,null,null,null,null,null,null,null,null,null,null,null,null,null,null,null,null,null,null,null,null,null,null,null,null,null,null,null,null,null,null,null,null,null,null,null,null,null,null,null,null,null,null,null,null,null,null,null,null,null,null,null,null,null,null,null,null,null,null,null,null,null,null,null,null,null,null,null,null,null,null,null,null,null,null,null,null,null,null,null,null,null,null,null,null,null,null,null,null,null,null,null,null,null,null,null,null,null,null,null,null,null,null,null,null,null,null,null,null,null,null,null,null,null,null,null,null,null,null,null,null,null,null,null,null,null,null,null,null,null,null,null,null,null,null,null,null,null,null,null,null,null,null,null,null,null,null,null,null,null,null,null,null,null,null,null,null,null,null,null,null,null,null,null,null,null,null,null,null,null,null,null,null,null,null,null,null,null,null,null,null,null,null,null,null,null,null,null,null,null,null,null,null,null,null,null,null,null,null,null,null,null,null,null,null,null,null,null,null,null,null,null,null,null,null,null,null,null,null,null,null,null,null,null,null,null,null,null,null,null,null,null,null,null,null,null,null,null,null,null,null,null,null,null,null,null,null,null,null,null,null,null,null,null,null,null,null,null,null,null,null,null,null,null,null,null,null,null,null,null,null,null,null,null,null,null,null,null,null,null,null,null,null,null,null,null,null,null,null,null,null,null,null,null,null,null,null,null,null,null,null,null,null,null,null,null,null,null,null,null,null,null,null,null,null,null,null,null,null,null,null,null,null,null,null,null,null,null,null,null,null,null,null,null,null,null,null,null,null,null,null,null,null,null,null,null,null,null,null,null,null,null,null,null,null,null,null,null,null,null,null,null,null,null,null,null,null,null,null,null,null,null,null,null,null,null,null,null,null,null,null,null,null,null,null,null,null,null,null,null,null,null,null,null,null,null,null,null,null,null,null,null,null,null,null,null,null,null,null,null,null,null,null,null,null,null,null,null,null,null,null,null,null,null,null,null,null,null,null,null,null,null,null,null,null,null,null,null,null,null,null,null,null,null,null,null,null,null,null,null,null,null,null,null,null,null,null,null,null,null,null,null,null,null,null,null,null,null,null,null,null,null,null,null,null,null,null,null,null,null,null,null,null,null,null,null,null,null,null,null,null,null,null,null,null,null,null,null,null,null,null,null,null,null,null,null,null,null,null,null,null,null,null,null,null,null,null,null,null,null,null,null,null,null,null,null,null,null,null,null,null,null,null,null,null,null,null,null,null,null,null,null,null,null,null,null,null,null,null,null,null,null,null,null,null,null,null,null,null,null,null,null,null,null,null,null,null,null,null,null,null,null,null,null,null,null,null,null,null,null,null,null,null,null,null,null,null,null,null,null,null,null,null,null,null,null,null,null,null,null,null,null,null,null,null,null,null,null,null,null,null,null,null,null,null,null,null,null,null,null,null,null,null,null,null,null,null,null,null,null,null,null,null,null,null,null,null,null,null,null,null,null,null,null,null,null,null,null,null,null,null,null,null,null,null,null,null,null,null,null,null,null,null,null,null,null,null,null,null,null,null,null,null,null,null,null,null,null,null,null,null,null,null,null,null,null,null,null,null,null,null,null,null,null,null,null,null,null,null,null,null,null,null,null,null,null,null,null,null,null,null,null,null,null,null,null,null,null,null,null,null,null,null,null,null,null,null,null,null,null,null,null,null,null,null,null,null,null,null,null,null,null,null,null,null,null,null,null,null,null,null,null,null,null,null,null,null,null,null,null,null,null,null,null,null,null,null,null,null,null,null,null,null,null,null,null,null,null,null,null,null,null,null,null,null,null,null,null,null,null,null,null,null,null,null,null,null,null,null,null,null,null,null,null,null,null,null,null,null,null,null,null,null,null,null,null,null,null,null,null,null,null,null,null,null,null,null,null,null,null,null,null,null,null,null,null,null,null,null,null,null,null,null,null,null,null,null,null,null,null,null,null,null,null,null,null,null,null,null,null,null,null,null,null,null,null,null,null,null,null,null,null,null,null,null,null,null,null,null,null,null,null,null,null,null,null,null,null,null,null,null,null,null,null,null,null,null,null,null,null,null,null,null,null,null,null,null,null,null,null,null,null,null,null,null,null,null,null,null,null,null,null,null,null,null,null,null,null,null,null,null,null,null,null,null,null,null,null,null,null,null,null,null,null,null,null,null,null,null,null,null,null,null,null,null,null,null,null,null,null,null,null,null,null,null,null,null,null,null,null,null,null,null,null,null,null,null,null,null,null,null,null,null,null,null,null,null,null,null,null,null,null,null,null,null,null,null,null,null,null,null,null,null,null,null,null,null,null,null,null,null,null,null,null,null,null,null,null,null,null,null,null,null,null,null,null,null,null,null,null,null,null,null,null,null,null,null,null,null,null,null,null,null,null,null,null,null,null,null,null,null,null,null,null,null,null,null,null,null,null,null,null,null,null,null,null,null,null,null,null,null,null,null,null,null,null,null,null,null,null,null,null,null,null,null,null,null,null,null,null,null,null,null,null,null,null,null,null,null,null,null,null,null,null,null,null,null,null,null,null,null,null,null,null,null,null,null,null,null,null,null,null,null,null,null,null,null,null,null,null,null,null,null,null,null,null,null,null,null,null,null,null,null,null,null,null,null,null,null,null,null,null,null,null,null,null,null,null,null,null,null,null,null,null,null,null,null,null,null,null,null,null,null,null,null,null,null,null,null,null,null,null,null,null,null,null,null,null,null,null,null,null,null,null,null,null,null,null,null,null,null,null,null,null,null,null,null,null,null,null,null,null,null,null,null,null,null,null,null,null,null,null,null,null,null,null,null,null,null,null,null,null,null,null,null,null,null,null,null,null,null,null,null,null,null,null,null,null,null,null,null,null,null,null,null,null,null,null,null,null,null,null,null,null,null,null,null,null,null,null,null,null,null,null,null,null,null,null,null,null,null,null,null,null,null,null,null,null,null,null,null,null,null,null,null,null,null,null,null,null,null,null,null,null,null,null,null,null,null,null,null,null,null,null,null,null,null,null,null,null,null,null,null,null,null,null,null,null,null,null,null,null,null,null,null,null,null,null,null,null,null,null,null,null,null,null,null,null,null,null,null,null,null,null,null,null,null,null,null,null,null,null,null,null,null,null,null,null,null,null,null,null,null,null,null,null,null,null,null,null,null,null,null,null,null,null,null,null,null,null,null,null,null,null,null,null,null,null,null,null,null,null,null,null,null,null,null,null,null,null,null,null,null,null,null,null,null,null,null,null,null,null,null,null,null,null,null,null,null,null,null,null,null,null,null,null,null,null,null,null,null,null,null,null,null,null,null,null,null,null,null,null,null,null,null,null,null,null,null,null,null,null,null,null,null,null,null,null,null,null,null,null,null,null,null,null,null,null,null,null,null,null,null,null,null,null,null,null,null,null,null,null,null,null,null,null,null,null,null,null,null,null,null,null,null,null,null,null,null,null,null,null,null,null,null,null,null,null,null,null,null,null,null,null,null,null,null,null,null,null,null,null,null,null,null,null,null,null,null,null,null,null,null,null,null,null,null,null,null,null,null,null,null,null,null,null,null,null,null,null,null,null,null,null,null,null,null,null,null,null,null,null,null,null,null,null,null,null,null,null,null,null,null,null,null,null,null,null,null,null,null,null,null,null,null,null,null,null,null,null,null,null,null,null,null,null,null,null,null,null,null,null,null,null,null,null,null,null,null,null,null,null,null,null,null,null,null,null,null,null,null,null,null,null,null,null,null,null,null,null,null,null,null,null,null,null,null,null,null,null,null,null,null,null,null,null,null,null,null,null,null,null,null,null,null,null,null,null,null,null,null,null,null,null,null,null,null,null,null,null,null,null,null,null,null,null,null,null,null,null,null,null,null,null,null,null,null,null,null,null,null,null,null,null,null,null,null,null,null,null,null,null,null,null,null,null,null,null,null,null,null,null,null,null,null,null,null,null,null,null,null,null,null,null,null,null,null,null,null,null,null,null,null,null,null,null,null,null,null,null,null,null,null,null,null,null,null,null,null,null,null,null,null,null,null,null,null,null,null,null,null,null,null,null,null,null,null,null,null,null,null,null,null,null,null,null,null,null,null,null,null,null,null,null,null,null,null,null,null,null,null,null,null,null,null,null,null,null,null,null,null,null,null,null,null,null,null,null,null,null,null,null,null,null,null,null,null,null,null,null,null,null,null,null,null,null,null,null,null,null,null,null,null,null,null,null,null,null,null,null,null,null,null,null,null,null,null,null,null,null,null,null,null,null,null,null,null,null,null,null,null,null,null,null,null,null,null,null,null,null,null,null,null,null,null,null,null,null,null,null,null,null,null,null,null,null,null,null,null,null,null,null,null,null,null,null,null,null,null,null,null,null,null,null,null,null,null,null,null,null,null,null,null,null,null,null,null,null,null,null,null,null,null,null,null,null,null,null,null,null,null,null,null,null,null,null,null,null,null,null,null,null,null,null,null,null,null,null,null,null,null,null,null,null,null,null,null,null,null,null,null,null,null,null,null,null,null,null,null,null,null,null,null,null,null,null,null,null,null,null,null,null,null,null,null,null,null,null,null,null,null,null,null,null,null,null,null,null,null,null,null,null,null,null,null,null,null,null,null,null,null,null,null,null,null,null,null,null,null,null,null,null,null,null,null,null,null,null,null,null,null,null,null,null,null,null,null,null,null,null,null,null,null,null,null,null,null,null,null,null,null,null,null,null,null,null,null,null,null,null,null,null,null,null,null,null,null,null,null,null,null,null,null,null,null,null,null,null,null,null,null,null,null,null,null,null,null,null,null,null,null,null,null,null,null,null,null,null,null,null,null,null,null,null,null,null,null,null,null,null,null,null,null,null,null,null,null,null,null,null,null,null,null,null,null,null,null,null,null,null,null,null,null,null,null,null,null,null,null,null,null,null,null,null,null,null,null,null,null,null,null,null,null,null,null,null,null,null,null,null,null,null,null,null,null,null,null,null,null,null,null,null,null,null,null,null,null,null,null,null,null,null,null,null,null,null,null,null,null,null,null,null,null,null,null,null,null,null,null,null,null,null,null,null,null,null,null,null,null,null,null,null,null,null,null,null,null,null,null,null,null,null,null,null,null,null,null,null,null,null,null,null,null,null,null,null,null,null,null,null,null,null,null,null,null,null,null,null,null,null,null,null,null,null,null,null,null,null,null,null,null,null,null,null,null,null,null,null,null,null,null,null,null,null,null,null,null,null,null,null,null,null,null,null,null,null,null,null,null,null,null,null,null,null,null,null,null,null,null,null,null,null,null,null,null,null,null,null,null,null,null,null,null,null,null,null,null,null,null,null,null,null,null,null,null,null,null,null,null,null,null,null,null,null,null,null,null,null,null,null,null,null,null,null,null,null,null,null,null,null,null,null,null,null,null,null,null,null,null,null,null,null,null,null,null,null,null,null,null,null,null,null,null,null,null,null,null,null,null,null,null,null,null,null,null,null,null,null,null,null,null,null,null,null,null,null,null,null,null,null,null,null,null,null,null,null,null,null,null,null,null,null,null,null,null,null,null,null,null,null,null,null,null,null,null,null,null,null,null,null,null,null,null,null,null,null,null,null,null,null,null,null,null,null,null,null,null,null,null,null,null,null,null,null,null,null,null,null,null,null,null,null,null,null,null,null,null,null,null,null,null,null,null,null,null,null,null,null,null,null,null,null,null,null,null,null,null,null,null,null,null,null,null,null,null,null,null,null,null,null,null,null,null,null,null,null,null,null,null,null,null,null,null,null,null,null,null,null,null,null,null,null,null,null,null,null,null,null,null,null,null,null,null,null,null,null,null,null,null,null,null,null,null,null,null,null,null,null,null,null,null,null,null,null,null,null,null,null,null,null,null,null,null,null,null,null,null,null,null,null,null,null,null,null,null,null,null,null,null,null,null,null,null,null,null,null,null,null,null,null,null,null,null,null,null,null,null,null,null,null,null,null,null,null,null,null,null,null,null,null,null,null,null,null,null,null,null,null,null,null,null,null,null,null,null,null,null,null,null,null,null,null,null,null,null,null,null,null,null,null,null,null,null,null,null,null,null,null,null,null,null,null,null,null,null,null,null,null,null,null,null,null,null,null,null,null,null,null,null,null,null,null,null,null,null,null,null,null,null,null,null,null,null,null,null,null,null,null,null,null,null,null,null,null,null,null,null,null,null,null,null,null,null,null,null,null,null,null,null,null,null,null,null,null,null,null,null,null,null,null,null,null,null,null,null,null,null,null,null,null,null,null,null,null,null,null,null,null,null,null,null,null,null,null,null,null,null,null,null,null,null,null,null,null,null,null,null,null,null,null,null,null,null,null,null,null,null,null,null,null,null,null,null,null,null,null,null,null,null,null,null,null,null,null,null,null,null,null,null,null,null,null,null,null,null,null,null,null,null,null,null,null,null,null,null,null,null,null,null,null,null,null,null,null,null,null,null,null,null,null,null,null,null,null,null,null,null,null,null,null,null,null,null,null,null,null,null,null,null,null,null,null,null,null,null,null,null,null,null,null,null,null,null,null,null,null,null,null,null,null,null,null,null,null,null,null,null,null,null,null,null,null,null,null,null,null,null,null,null,null,null,null,null,null,null,null,null,null,null,null,null,null,null,null,null,null,null,null,null,null,null,null,null,null,null,null,null,null,null,null,null,null,null,null,null,null,null,null,null,null,null,null,null,null,null,null,null,null,null,null,null,null,null,null,null,null,null,null,null,null,null,null,null,null,null,null,null,null,null,null,null,null,null,null,null,null,null,null,null,null,null,null,null,null,null,null,null,null,null,null,null,null,null,null,null,null,null,null,null,null,null,null,null,null,null,null,null,null,null,null,null,null,null,null,null,null,null,null,null,null,null,null,null,null,null,null,null,null,null,null,null,null,null,null,null,null,null,null,null,null,null,null,null,null,null,null,null,null,null,null,null,null,null,null,null,null,null,null,null,null,null,null,null,null,null,null,null,null,null,null,null,null,null,null,null,null,null,null,null,null,null,null,null,null,null,null,null,null,null,null,null,null,null,null,null,null,null,null,null,null,null,null,null,null,null,null,null,null,null,null,null,null,null,null,null,null,null,null,null,null,null,null,null,null,null,null,null,null,null,null,null,null,null,null,null,null,null,null,null,null,null,null,null,null,null,null,null,null,null,null,null,null,null,null,null,null,null,null,null,null,null,null,null,null,null,null,null,null,null,null,null,null,null,null,null,null,null,null,null,null,null,null,null,null,null,null,null,null,null,null,null,null,null,null,null,null,null,null,null,null,null,null,null,null,null,null,null,null,null,null,null,null,null,null,null,null,null,null,null,null,null,null,null,null,null,null,null,null,null,null,null,null,null,null,null,null,null,null,null,null,null,null,null,null,null,null,null,null,null,null,null,null,null,null,null,null,null,null,null,null,null,null,null,null,null,null,null,null,null,null,null,null,null,null,null,null,null,null,null,null,null,null,null,null,null,null,null,null,null,null,null,null,null,null,null,null,null,null,null,null,null,null,null,null,null,null,null,null,null,null,null,null,null,null,null,null,null,null,null,null,null,null,null,null,null,null,null,null,null,null,null,null,null,null,null,null,null,null,null,null,null,null,null,null,null,null,null,null,null,null,null,null,null,null,null,null,null,null,null,null,null,null,null,null,null,null,null,null,null,null,null,null,null,null,null,null,null,null,null,null,null,null,null,null,null,null,null,null,null,null,null,null,null,null,null,null,null,null,null,null,null,null,null,null,null,null,null,null,null,null,null,null,null,null,null,null,null,null,null,null,null,null,null,null,null,null,null,null,null,null,null,null,null,null,null,null,null,null,null,null,null,null,null,null,null,null,null,null,null,null,null,null,null,null,null,null,null,null,null,null,null,null,null,null,null,null,null,null,null,null,null,null,null,null,null,null,null,null,null,null,null,null,null,null,null,null,null,null,null,null,null,null,null,null,null,null,null,null,null,null,null,null,null,null,null,null,null,null,null,null,null,null,null,null,null,null,null,null,null,null,null,null,null,null,null,null,null,null,null,null,null,null,null,null,null,null,null,null,null,null,null,null,null,null,null,null,null,null,null,null,null,null,null,null,null,null,null,null,null,null,null,null,null,null,null,null,null,null,null,null,null,null,null,null,null,null,null,null,null,null,null,null,null,null,null,null,null,null,null,null,null,null,null,null,null,null,null,null,null,null,null,null,null,null,null,null,null,null,null,null,null,null,null,null,null,null,null,null,null,null,null,null,null,null,null,null,null,null,null,null,null,null,null,null,null,null,null,null,null,null,null,null,null,null,null,null,null,null,null,null,null,null,null,null,null,null,null,null,null,null,null,null,null,null,null,null,null,null,null,null,null,null,null,null,null,null,null,null,null,null,null,null,null,null,null,null,null,null,null,null,null,null,null,null,null,null,null,null,null,null,null,null,null,null,null,null,null,null,null,null,null,null,null,null,null,null,null,null,null,null,null,null,null,null,null,null,null,null,null,null,null,null,null,null,null,null,null,null,null,null,null,null,null,null,null,null,null,null,null,null,null,null,null,null,null,null,null,null,null,null,null,null,null,null,null,null,null,null,null,null,null,null,null,null,null,null,null,null,null,null,null,null,null,null,null,null,null,null,null,null,null,null,null,null,null,null,null,null,null,null,null,null,null,null,null,null,null,null,null,null,null,null,null,null,null,null,null,null,null,null,null,null,null,null,null,null,null,null,null,null,null,null,null,null,null,null,null,null,null,null,null,null,null,null,null,null,null,null,null,null,null,null,null,null,null,null,null,null,null,null,null,null,null,null,null,null,null,null,null,null,null,null,null,null,null,null,null,null,null,null,null,null,null,null,null,null,null,null,null,null,null,null,null,null,null,null,null,null,null,null,null,null,null,null,null,null,null,null,null,null,null,null,null,null,null,null,null,null,null,null,null,null,null,null,null,null,null,null,null,null,null,null,null,null,null,null,null,null,null,null,null,null,null,null,null,null,null,null,null,null,null,null,null,null,null,null,null,null,null,null,null,null,null,null,null,null,null,null,null,null,null,null,null,null,null,null,null,null,null,null,null,null,null,null,null,null,null,null,null,null,null,null,null,null,null,null,null,null,null,null,null,null,null,null,null,null,null,null,null,null,null,null,null,null,null,null,null,null,null,null,null,null,null,null,null,null,null,null,null,null,null,null,null,null,null,null,null,null,null,null,null,null,null,null,null,null,null,null,null,null,null,null,null,null,null,null,null,null,null,null,null,null,null,null,null,null,null,null,null,null,null,null,null,null,null,null,null,null,null,null,null,null,null,null,null,null,null,null,null,null,null,null,null,null,null,null,null,null,null,null,null,null,null,null,null,null,null,null,null,null,null,null,null,null,null,null,null,null,null,null,null,null,null,null,null,null,null,null,null,null,null,null,null,null,null,null,null,null,null,null,null,null,null,null,null,null,null,null,null,null,null,null,null,null,null,null,null,null,null,null,null,null,null,null,null,null,null,null,null,null,null,null,null,null,null,null,null,null,null,null,null,null,null,null,null,null,null,null,null,null,null,null,null,null,null,null,null,null,null,null,null,null,null,null,null,null,null,null,null,null,null,null,null,null,null,null,null,null,null,null,null,null,null,null,null,null,null,null,null,null,null,null,null,null,null,null,null,null,null,null,null,null,null,null,null,null,null,null,null,null,null,null,null,null,null,null,null,null,null,null,null,null,null,null,null,null,null,null,null,null,null,null,null,null,null,null,null,null,null,null,null,null,null,null,null,null,null,null,null,null,null,null,null,null,null,null,null,null,null,null,null,null,null,null,null,null,null,null,null,null,null,null,null,null,null,null,null,null,null,null,null,null,null,null,null,null,null,null,null,null,null,null,null,null,null,null,null,null,null,null,null,null,null,null,null,null,null,null,null,null,null,null,null,null,null,null,null,null,null,null,null,null,null,null,null,null,null,null,null,null,null,null,null,null,null,null,null,null,null,null,null,null,null,null,null,null,null,null,null,null,null,null,null,null,null,null,null,null,null,null,null,null,null,null,null,null,null,null,null,null,null,null,null,null,null,null,null,null,null,null,null,null,null,null,null,null,null,null,null,null,null,null,null,null,null,null,null,null,null,null,null,null,null,null,null,null,null,null,null,null,null,null,null,null,null,null,null,null,null,null,null,null,null,null,null,null,null,null,null,null,null,null,null,null,null,null,null,null,null,null,null,null,null,null,null,null,null,null,null,null,null,null,null,null,null,null,null,null,null,null,null,null,null,null,null,null,null,null,null,null,null,null,null,null,null,null,null,null,null,null,{"$f":"IF(SUM(COUNTIF(C43:C49,\">=1\"))>=1,\"yes\",\"no\")","v":"no"}]
[null,null,null,null,null,null,null,null,null,null,null,null,null,null,null,null,null,null,null,null,null,null,null,null,null,null,null,null,null,null,null,null,null,null,null,null,null,null,null,null,null,null,null,null,null,null,null,null,null,null,null,null,null,null,null,null,null,null,null,null,null,null,null,null,null,null,null,null,null,null,null,null,null,null,null,null,null,null,null,null,null,null,null,null,null,null,null,null,null,null,null,null,null,null,null,null,null,null,null,null,null,null,null,null,null,null,null,null,null,null,null,null,null,null,null,null,null,null,null,null,null,null,null,null,null,null,null,null,null,null,null,null,null,null,null,null,null,null,null,null,null,null,null,null,null,null,null,null,null,null,null,null,null,null,null,null,null,null,null,null,null,null,null,null,null,null,null,null,null,null,null,null,null,null,null,null,null,null,null,null,null,null,null,null,null,null,null,null,null,null,null,null,null,null,null,null,null,null,null,null,null,null,null,null,null,null,null,null,null,null,null,null,null,null,null,null,null,null,null,null,null,null,null,null,null,null,null,null,null,null,null,null,null,null,null,null,null,null,null,null,null,null,null,null,null,null,null,null,null,null,null,null,null,null,null,null,null,null,null,null,null,null,null,null,null,null,null,null,null,null,null,null,null,null,null,null,null,null,null,null,null,null,null,null,null,null,null,null,null,null,null,null,null,null,null,null,null,null,null,null,null,null,null,null,null,null,null,null,null,null,null,null,null,null,null,null,null,null,null,null,null,null,null,null,null,null,null,null,null,null,null,null,null,null,null,null,null,null,null,null,null,null,null,null,null,null,null,null,null,null,null,null,null,null,null,null,null,null,null,null,null,null,null,null,null,null,null,null,null,null,null,null,null,null,null,null,null,null,null,null,null,null,null,null,null,null,null,null,null,null,null,null,null,null,null,null,null,null,null,null,null,null,null,null,null,null,null,null,null,null,null,null,null,null,null,null,null,null,null,null,null,null,null,null,null,null,null,null,null,null,null,null,null,null,null,null,null,null,null,null,null,null,null,null,null,null,null,null,null,null,null,null,null,null,null,null,null,null,null,null,null,null,null,null,null,null,null,null,null,null,null,null,null,null,null,null,null,null,null,null,null,null,null,null,null,null,null,null,null,null,null,null,null,null,null,null,null,null,null,null,null,null,null,null,null,null,null,null,null,null,null,null,null,null,null,null,null,null,null,null,null,null,null,null,null,null,null,null,null,null,null,null,null,null,null,null,null,null,null,null,null,null,null,null,null,null,null,null,null,null,null,null,null,null,null,null,null,null,null,null,null,null,null,null,null,null,null,null,null,null,null,null,null,null,null,null,null,null,null,null,null,null,null,null,null,null,null,null,null,null,null,null,null,null,null,null,null,null,null,null,null,null,null,null,null,null,null,null,null,null,null,null,null,null,null,null,null,null,null,null,null,null,null,null,null,null,null,null,null,null,null,null,null,null,null,null,null,null,null,null,null,null,null,null,null,null,null,null,null,null,null,null,null,null,null,null,null,null,null,null,null,null,null,null,null,null,null,null,null,null,null,null,null,null,null,null,null,null,null,null,null,null,null,null,null,null,null,null,null,null,null,null,null,null,null,null,null,null,null,null,null,null,null,null,null,null,null,null,null,null,null,null,null,null,null,null,null,null,null,null,null,null,null,null,null,null,null,null,null,null,null,null,null,null,null,null,null,null,null,null,null,null,null,null,null,null,null,null,null,null,null,null,null,null,null,null,null,null,null,null,null,null,null,null,null,null,null,null,null,null,null,null,null,null,null,null,null,null,null,null,null,null,null,null,null,null,null,null,null,null,null,null,null,null,null,null,null,null,null,null,null,null,null,null,null,null,null,null,null,null,null,null,null,null,null,null,null,null,null,null,null,null,null,null,null,null,null,null,null,null,null,null,null,null,null,null,null,null,null,null,null,null,null,null,null,null,null,null,null,null,null,null,null,null,null,null,null,null,null,null,null,null,null,null,null,null,null,null,null,null,null,null,null,null,null,null,null,null,null,null,null,null,null,null,null,null,null,null,null,null,null,null,null,null,null,null,null,null,null,null,null,null,null,null,null,null,null,null,null,null,null,null,null,null,null,null,null,null,null,null,null,null,null,null,null,null,null,null,null,null,null,null,null,null,null,null,null,null,null,null,null,null,null,null,null,null,null,null,null,null,null,null,null,null,null,null,null,null,null,null,null,null,null,null,null,null,null,null,null,null,null,null,null,null,null,null,null,null,null,null,null,null,null,null,null,null,null,null,null,null,null,null,null,null,null,null,null,null,null,null,null,null,null,null,null,null,null,null,null,null,null,null,null,null,null,null,null,null,null,null,null,null,null,null,null,null,null,null,null,null,null,null,null,null,null,null,null,null,null,null,null,null,null,null,null,null,null,null,null,null,null,null,null,null,null,null,null,null,null,null,null,null,null,null,null,null,null,null,null,null,null,null,null,null,null,null,null,null,null,null,null,null,null,null,null,null,null,null,null,null,null,null,null,null,null,null,null,null,null,null,null,null,null,null,null,null,null,null,null,null,null,null,null,null,null,null,null,null,null,null,null,null,null,null,null,null,null,null,null,null,null,null,null,null,null,null,null,null,null,null,null,null,null,null,null,null,null,null,null,null,null,null,null,null,null,null,null,null,null,null,null,null,null,null,null,null,null,null,null,null,null,null,null,null,null,null,null,null,null,null,null,null,null,null,null,null,null,null,null,null,null,null,null,null,null,null,null,null,null,null,null,null,null,null,null,null,null,null,null,null,null,null,null,null,null,null,null,null,null,null,null,null,null,null,null,null,null,null,null,null,null,null,null,null,null,null,null,null,null,null,null,null,null,null,null,null,null,null,null,null,null,null,null,null,null,null,null,null,null,null,null,null,null,null,null,null,null,null,null,null,null,null,null,null,null,null,null,null,null,null,null,null,null,null,null,null,null,null,null,null,null,null,null,null,null,null,null,null,null,null,null,null,null,null,null,null,null,null,null,null,null,null,null,null,null,null,null,null,null,null,null,null,null,null,null,null,null,null,null,null,null,null,null,null,null,null,null,null,null,null,null,null,null,null,null,null,null,null,null,null,null,null,null,null,null,null,null,null,null,null,null,null,null,null,null,null,null,null,null,null,null,null,null,null,null,null,null,null,null,null,null,null,null,null,null,null,null,null,null,null,null,null,null,null,null,null,null,null,null,null,null,null,null,null,null,null,null,null,null,null,null,null,null,null,null,null,null,null,null,null,null,null,null,null,null,null,null,null,null,null,null,null,null,null,null,null,null,null,null,null,null,null,null,null,null,null,null,null,null,null,null,null,null,null,null,null,null,null,null,null,null,null,null,null,null,null,null,null,null,null,null,null,null,null,null,null,null,null,null,null,null,null,null,null,null,null,null,null,null,null,null,null,null,null,null,null,null,null,null,null,null,null,null,null,null,null,null,null,null,null,null,null,null,null,null,null,null,null,null,null,null,null,null,null,null,null,null,null,null,null,null,null,null,null,null,null,null,null,null,null,null,null,null,null,null,null,null,null,null,null,null,null,null,null,null,null,null,null,null,null,null,null,null,null,null,null,null,null,null,null,null,null,null,null,null,null,null,null,null,null,null,null,null,null,null,null,null,null,null,null,null,null,null,null,null,null,null,null,null,null,null,null,null,null,null,null,null,null,null,null,null,null,null,null,null,null,null,null,null,null,null,null,null,null,null,null,null,null,null,null,null,null,null,null,null,null,null,null,null,null,null,null,null,null,null,null,null,null,null,null,null,null,null,null,null,null,null,null,null,null,null,null,null,null,null,null,null,null,null,null,null,null,null,null,null,null,null,null,null,null,null,null,null,null,null,null,null,null,null,null,null,null,null,null,null,null,null,null,null,null,null,null,null,null,null,null,null,null,null,null,null,null,null,null,null,null,null,null,null,null,null,null,null,null,null,null,null,null,null,null,null,null,null,null,null,null,null,null,null,null,null,null,null,null,null,null,null,null,null,null,null,null,null,null,null,null,null,null,null,null,null,null,null,null,null,null,null,null,null,null,null,null,null,null,null,null,null,null,null,null,null,null,null,null,null,null,null,null,null,null,null,null,null,null,null,null,null,null,null,null,null,null,null,null,null,null,null,null,null,null,null,null,null,null,null,null,null,null,null,null,null,null,null,null,null,null,null,null,null,null,null,null,null,null,null,null,null,null,null,null,null,null,null,null,null,null,null,null,null,null,null,null,null,null,null,null,null,null,null,null,null,null,null,null,null,null,null,null,null,null,null,null,null,null,null,null,null,null,null,null,null,null,null,null,null,null,null,null,null,null,null,null,null,null,null,null,null,null,null,null,null,null,null,null,null,null,null,null,null,null,null,null,null,null,null,null,null,null,null,null,null,null,null,null,null,null,null,null,null,null,null,null,null,null,null,null,null,null,null,null,null,null,null,null,null,null,null,null,null,null,null,null,null,null,null,null,null,null,null,null,null,null,null,null,null,null,null,null,null,null,null,null,null,null,null,null,null,null,null,null,null,null,null,null,null,null,null,null,null,null,null,null,null,null,null,null,null,null,null,null,null,null,null,null,null,null,null,null,null,null,null,null,null,null,null,null,null,null,null,null,null,null,null,null,null,null,null,null,null,null,null,null,null,null,null,null,null,null,null,null,null,null,null,null,null,null,null,null,null,null,null,null,null,null,null,null,null,null,null,null,null,null,null,null,null,null,null,null,null,null,null,null,null,null,null,null,null,null,null,null,null,null,null,null,null,null,null,null,null,null,null,null,null,null,null,null,null,null,null,null,null,null,null,null,null,null,null,null,null,null,null,null,null,null,null,null,null,null,null,null,null,null,null,null,null,null,null,null,null,null,null,null,null,null,null,null,null,null,null,null,null,null,null,null,null,null,null,null,null,null,null,null,null,null,null,null,null,null,null,null,null,null,null,null,null,null,null,null,null,null,null,null,null,null,null,null,null,null,null,null,null,null,null,null,null,null,null,null,null,null,null,null,null,null,null,null,null,null,null,null,null,null,null,null,null,null,null,null,null,null,null,null,null,null,null,null,null,null,null,null,null,null,null,null,null,null,null,null,null,null,null,null,null,null,null,null,null,null,null,null,null,null,null,null,null,null,null,null,null,null,null,null,null,null,null,null,null,null,null,null,null,null,null,null,null,null,null,null,null,null,null,null,null,null,null,null,null,null,null,null,null,null,null,null,null,null,null,null,null,null,null,null,null,null,null,null,null,null,null,null,null,null,null,null,null,null,null,null,null,null,null,null,null,null,null,null,null,null,null,null,null,null,null,null,null,null,null,null,null,null,null,null,null,null,null,null,null,null,null,null,null,null,null,null,null,null,null,null,null,null,null,null,null,null,null,null,null,null,null,null,null,null,null,null,null,null,null,null,null,null,null,null,null,null,null,null,null,null,null,null,null,null,null,null,null,null,null,null,null,null,null,null,null,null,null,null,null,null,null,null,null,null,null,null,null,null,null,null,null,null,null,null,null,null,null,null,null,null,null,null,null,null,null,null,null,null,null,null,null,null,null,null,null,null,null,null,null,null,null,null,null,null,null,null,null,null,null,null,null,null,null,null,null,null,null,null,null,null,null,null,null,null,null,null,null,null,null,null,null,null,null,null,null,null,null,null,null,null,null,null,null,null,null,null,null,null,null,null,null,null,null,null,null,null,null,null,null,null,null,null,null,null,null,null,null,null,null,null,null,null,null,null,null,null,null,null,null,null,null,null,null,null,null,null,null,null,null,null,null,null,null,null,null,null,null,null,null,null,null,null,null,null,null,null,null,null,null,null,null,null,null,null,null,null,null,null,null,null,null,null,null,null,null,null,null,null,null,null,null,null,null,null,null,null,null,null,null,null,null,null,null,null,null,null,null,null,null,null,null,null,null,null,null,null,null,null,null,null,null,null,null,null,null,null,null,null,null,null,null,null,null,null,null,null,null,null,null,null,null,null,null,null,null,null,null,null,null,null,null,null,null,null,null,null,null,null,null,null,null,null,null,null,null,null,null,null,null,null,null,null,null,null,null,null,null,null,null,null,null,null,null,null,null,null,null,null,null,null,null,null,null,null,null,null,null,null,null,null,null,null,null,null,null,null,null,null,null,null,null,null,null,null,null,null,null,null,null,null,null,null,null,null,null,null,null,null,null,null,null,null,null,null,null,null,null,null,null,null,null,null,null,null,null,null,null,null,null,null,null,null,null,null,null,null,null,null,null,null,null,null,null,null,null,null,null,null,null,null,null,null,null,null,null,null,null,null,null,null,null,null,null,null,null,null,null,null,null,null,null,null,null,null,null,null,null,null,null,null,null,null,null,null,null,null,null,null,null,null,null,null,null,null,null,null,null,null,null,null,null,null,null,null,null,null,null,null,null,null,null,null,null,null,null,null,null,null,null,null,null,null,null,null,null,null,null,null,null,null,null,null,null,null,null,null,null,null,null,null,null,null,null,null,null,null,null,null,null,null,null,null,null,null,null,null,null,null,null,null,null,null,null,null,null,null,null,null,null,null,null,null,null,null,null,null,null,null,null,null,null,null,null,null,null,null,null,null,null,null,null,null,null,null,null,null,null,null,null,null,null,null,null,null,null,null,null,null,null,null,null,null,null,null,null,null,null,null,null,null,null,null,null,null,null,null,null,null,null,null,null,null,null,null,null,null,null,null,null,null,null,null,null,null,null,null,null,null,null,null,null,null,null,null,null,null,null,null,null,null,null,null,null,null,null,null,null,null,null,null,null,null,null,null,null,null,null,null,null,null,null,null,null,null,null,null,null,null,null,null,null,null,null,null,null,null,null,null,null,null,null,null,null,null,null,null,null,null,null,null,null,null,null,null,null,null,null,null,null,null,null,null,null,null,null,null,null,null,null,null,null,null,null,null,null,null,null,null,null,null,null,null,null,null,null,null,null,null,null,null,null,null,null,null,null,null,null,null,null,null,null,null,null,null,null,null,null,null,null,null,null,null,null,null,null,null,null,null,null,null,null,null,null,null,null,null,null,null,null,null,null,null,null,null,null,null,null,null,null,null,null,null,null,null,null,null,null,null,null,null,null,null,null,null,null,null,null,null,null,null,null,null,null,null,null,null,null,null,null,null,null,null,null,null,null,null,null,null,null,null,null,null,null,null,null,null,null,null,null,null,null,null,null,null,null,null,null,null,null,null,null,null,null,null,null,null,null,null,null,null,null,null,null,null,null,null,null,null,null,null,null,null,null,null,null,null,null,null,null,null,null,null,null,null,null,null,null,null,null,null,null,null,null,null,null,null,null,null,null,null,null,null,null,null,null,null,null,null,null,null,null,null,null,null,null,null,null,null,null,null,null,null,null,null,null,null,null,null,null,null,null,null,null,null,null,null,null,null,null,null,null,null,null,null,null,null,null,null,null,null,null,null,null,null,null,null,null,null,null,null,null,null,null,null,null,null,null,null,null,null,null,null,null,null,null,null,null,null,null,null,null,null,null,null,null,null,null,null,null,null,null,null,null,null,null,null,null,null,null,null,null,null,null,null,null,null,null,null,null,null,null,null,null,null,null,null,null,null,null,null,null,null,null,null,null,null,null,null,null,null,null,null,null,null,null,null,null,null,null,null,null,null,null,null,null,null,null,null,null,null,null,null,null,null,null,null,null,null,null,null,null,null,null,null,null,null,null,null,null,null,null,null,null,null,null,null,null,null,null,null,null,null,null,null,null,null,null,null,null,null,null,null,null,null,null,null,null,null,null,null,null,null,null,null,null,null,null,null,null,null,null,null,null,null,null,null,null,null,null,null,null,null,null,null,null,null,null,null,null,null,null,null,null,null,null,null,null,null,null,null,null,null,null,null,null,null,null,null,null,null,null,null,null,null,null,null,null,null,null,null,null,null,null,null,null,null,null,null,null,null,null,null,null,null,null,null,null,null,null,null,null,null,null,null,null,null,null,null,null,null,null,null,null,null,null,null,null,null,null,null,null,null,null,null,null,null,null,null,null,null,null,null,null,null,null,null,null,null,null,null,null,null,null,null,null,null,null,null,null,null,null,null,null,null,null,null,null,null,null,null,null,null,null,null,null,null,null,null,null,null,null,null,null,null,null,null,null,null,null,null,null,null,null,null,null,null,null,null,null,null,null,null,null,null,null,null,null,null,null,null,null,null,null,null,null,null,null,null,null,null,null,null,null,null,null,null,null,null,null,null,null,null,null,null,null,null,null,null,null,null,null,null,null,null,null,null,null,null,null,null,null,null,null,null,null,null,null,null,null,null,null,null,null,null,null,null,null,null,null,null,null,null,null,null,null,null,null,null,null,null,null,null,null,null,null,null,null,null,null,null,null,null,null,null,null,null,null,null,null,null,null,null,null,null,null,null,null,null,null,null,null,null,null,null,null,null,null,null,null,null,null,null,null,null,null,null,null,null,null,null,null,null,null,null,null,null,null,null,null,null,null,null,null,null,null,null,null,null,null,null,null,null,null,null,null,null,null,null,null,null,null,null,null,null,null,null,null,null,null,null,null,null,null,null,null,null,null,null,null,null,null,null,null,null,null,null,null,null,null,null,null,null,null,null,null,null,null,null,null,null,null,null,null,null,null,null,null,null,null,null,null,null,null,null,null,null,null,null,null,null,null,null,null,null,null,null,null,null,null,null,null,null,null,null,null,null,null,null,null,null,null,null,null,null,null,null,null,null,null,null,null,null,null,null,null,null,null,null,null,null,null,null,null,null,null,null,null,null,null,null,null,null,null,null,null,null,null,null,null,null,null,null,null,null,null,null,null,null,null,null,null,null,null,null,null,null,null,null,null,null,null,null,null,null,null,null,null,null,null,null,null,null,null,null,null,null,null,null,null,null,null,null,null,null,null,null,null,null,null,null,null,null,null,null,null,null,null,null,null,null,null,null,null,null,null,null,null,null,null,null,null,null,null,null,null,null,null,null,null,null,null,null,null,null,null,null,null,null,null,null,null,null,null,null,null,null,null,null,null,null,null,null,null,null,null,null,null,null,null,null,null,null,null,null,null,null,null,null,null,null,null,null,null,null,null,null,null,null,null,null,null,null,null,null,null,null,null,null,null,null,null,null,null,null,null,null,null,null,null,null,null,null,null,null,null,null,null,null,null,null,null,null,null,null,null,null,null,null,null,null,null,null,null,null,null,null,null,null,null,null,null,null,null,null,null,null,null,null,null,null,null,null,null,null,null,null,null,null,null,null,null,null,null,null,null,null,null,null,null,null,null,null,null,null,null,null,null,null,null,null,null,null,null,null,null,null,null,null,null,null,null,null,null,null,null,null,null,null,null,null,null,null,null,null,null,null,null,null,null,null,null,null,null,null,null,null,null,null,null,null,null,null,null,null,null,null,null,null,null,null,null,null,null,null,null,null,null,null,null,null,null,null,null,null,null,null,null,null,null,null,null,null,null,null,null,null,null,null,null,null,null,null,null,null,null,null,null,null,null,null,null,null,null,null,null,null,null,null,null,null,null,null,null,null,null,null,null,null,null,null,null,null,null,null,null,null,null,null,null,null,null,null,null,null,null,null,null,null,null,null,null,null,null,null,null,null,null,null,null,null,null,null,null,null,null,null,null,null,null,null,null,null,null,null,null,null,null,null,null,null,null,null,null,null,null,null,null,null,null,null,null,null,null,null,null,null,null,null,null,null,null,null,null,null,null,null,null,null,null,null,null,null,null,null,null,null,null,null,null,null,null,null,null,null,null,null,null,null,null,null,null,null,null,null,null,null,null,null,null,null,null,null,null,null,null,null,null,null,null,null,null,null,null,null,null,null,null,null,null,null,null,null,null,null,null,null,null,null,null,null,null,null,null,null,null,null,null,null,null,null,null,null,null,null,null,null,null,null,null,null,null,null,null,null,null,null,null,null,null,null,null,null,null,null,null,null,null,null,null,null,null,null,null,null,null,null,null,null,null,null,null,null,null,null,null,null,null,null,null,null,null,null,null,null,null,null,null,null,null,null,null,null,null,null,null,null,null,null,null,null,null,null,null,null,null,null,null,null,null,null,null,null,null,null,null,null,null,null,null,null,null,null,null,null,null,null,null,null,null,null,null,null,null,null,null,null,null,null,null,null,null,null,null,null,null,null,null,null,null,null,null,null,null,null,null,null,null,null,null,null,null,null,null,null,null,null,null,null,null,null,null,null,null,null,null,null,null,null,null,null,null,null,null,null,null,null,null,null,null,null,null,null,null,null,null,null,null,null,null,null,null,null,null,null,null,null,null,null,null,null,null,null,null,null,null,null,null,null,null,null,null,null,null,null,null,null,null,null,null,null,null,null,null,null,null,null,null,null,null,null,null,null,null,null,null,null,null,null,null,null,null,null,null,null,null,null,null,null,null,null,null,null,null,null,null,null,null,null,null,null,null,null,null,null,null,null,null,null,null,null,null,null,null,null,null,null,null,null,null,null,null,null,null,null,null,null,null,null,null,null,null,null,null,null,null,null,null,null,null,null,null,null,null,null,null,null,null,null,null,null,null,null,null,null,null,null,null,null,null,null,null,null,null,null,null,null,null,null,null,null,null,null,null,null,null,null,null,null,null,null,null,null,null,null,null,null,null,null,null,null,null,null,null,null,null,null,null,null,null,null,null,null,null,null,null,null,null,null,null,null,null,null,null,null,null,null,null,null,null,null,null,null,null,null,null,null,null,null,null,null,null,null,null,null,null,null,null,null,null,null,null,null,null,null,null,null,null,null,null,null,null,null,null,null,null,null,null,null,null,null,null,null,null,null,null,null,null,null,null,null,null,null,null,null,null,null,null,null,null,null,null,null,null,null,null,null,null,null,null,null,null,null,null,null,null,null,null,null,null,null,null,null,null,null,null,null,null,null,null,null,null,null,null,null,null,null,null,null,null,null,null,null,null,null,null,null,null,null,null,null,null,null,null,null,null,null,null,null,null,null,null,null,null,null,null,null,null,null,null,null,null,null,null,null,null,null,null,null,null,null,null,null,null,null,null,null,null,null,null,null,null,null,null,null,null,null,null,null,null,null,null,null,null,null,null,null,null,null,null,null,null,null,null,null,null,null,null,null,null,null,null,null,null,null,null,null,null,null,null,null,null,null,null,null,null,null,null,null,null,null,null,null,null,null,null,null,null,null,null,null,null,null,null,null,null,null,null,null,null,null,null,null,null,null,null,null,null,null,null,null,null,null,null,null,null,null,null,null,null,null,null,null,null,null,null,null,null,null,null,null,null,null,null,null,null,null,null,null,null,null,null,null,null,null,null,null,null,null,null,null,null,null,null,null,null,null,null,null,null,null,null,null,null,null,null,null,null,null,null,null,null,null,null,null,null,null,null,null,null,null,null,null,null,null,null,null,null,null,null,null,null,null,null,null,null,null,null,null,null,null,null,null,null,null,null,null,null,null,null,null,null,null,null,null,null,null,null,null,null,null,null,null,null,null,null,null,null,null,null,null,null,null,null,null,null,null,null,null,null,null,null,null,null,null,null,null,null,null,null,null,null,null,null,null,null,null,null,null,null,null,null,null,null,null,null,null,null,null,null,null,null,null,null,null,null,null,null,null,null,null,null,null,null,null,null,null,null,null,null,null,null,null,null,null,null,null,null,null,null,null,null,null,null,null,null,null,null,null,null,null,null,null,null,null,null,null,null,null,null,null,null,null,null,null,null,null,null,null,null,null,null,null,null,null,null,null,null,null,null,null,null,null,null,null,null,null,null,null,null,null,null,null,null,null,null,null,null,null,null,null,null,null,null,null,null,null,null,null,null,null,null,null,null,null,null,null,null,null,null,null,null,null,null,null,null,null,null,null,null,null,null,null,null,null,null,null,null,null,null,null,null,null,null,null,null,null,null,null,null,null,null,null,null,null,null,null,null,null,null,null,null,null,null,null,null,null,null,null,null,null,null,null,null,null,null,null,null,null,null,null,null,null,null,null,null,null,null,null,null,null,null,null,null,null,null,null,null,null,null,null,null,null,null,null,null,null,null,null,null,null,null,null,null,null,null,null,null,null,null,null,null,null,null,null,null,null,null,null,null,null,null,null,null,null,null,null,null,null,null,null,null,null,null,null,null,null,null,null,null,null,null,null,null,null,null,null,null,null,null,null,null,null,null,null,null,null,null,null,null,null,null,null,null,null,null,null,null,null,null,null,null,null,null,null,null,null,null,null,null,null,null,null,null,null,null,null,null,null,null,null,null,null,null,null,null,null,null,null,null,null,null,null,null,null,null,null,null,null,null,null,null,null,null,null,null,null,null,null,null,null,null,null,null,null,null,null,null,null,null,null,null,null,null,null,null,null,null,null,null,null,null,null,null,null,null,null,null,null,null,null,null,null,null,null,null,null,null,null,null,null,null,null,null,null,null,null,null,null,null,null,null,null,null,null,null,null,null,null,null,null,null,null,null,null,null,null,null,null,null,null,null,null,null,null,null,null,null,null,null,null,null,null,null,null,null,null,null,null,null,null,null,null,null,null,null,null,null,null,null,null,null,null,null,null,null,null,null,null,null,null,null,null,null,null,null,null,null,null,null,null,null,null,null,null,null,null,null,null,null,null,null,null,null,null,null,null,null,null,null,null,null,null,null,null,null,null,null,null,null,null,null,null,null,null,null,null,null,null,null,null,null,null,null,null,null,null,null,null,null,null,null,null,null,null,null,null,null,null,null,null,null,null,null,null,null,null,null,null,null,null,null,null,null,null,null,null,null,null,null,null,null,null,null,null,null,null,null,null,null,null,null,null,null,null,null,null,null,null,null,null,null,null,null,null,null,null,null,null,null,null,null,null,null,null,null,null,null,null,null,null,null,null,null,null,null,null,null,null,null,null,null,null,null,null,null,null,null,null,null,null,null,null,null,null,null,null,null,null,null,null,null,null,null,null,null,null,null,null,null,null,null,null,null,null,null,null,null,null,null,null,null,null,null,null,null,null,null,null,null,null,null,null,null,null,null,null,null,null,null,null,null,null,null,null,null,null,null,null,null,null,null,null,null,null,null,null,null,null,null,null,null,null,null,null,null,null,null,null,null,null,null,null,null,null,null,null,null,null,null,null,null,null,null,null,null,null,null,null,null,null,null,null,null,null,null,null,null,null,null,null,null,null,null,null,null,null,null,null,null,null,null,null,null,null,null,null,null,null,null,null,null,null,null,null,null,null,null,null,null,null,null,null,null,null,null,null,null,null,null,null,null,null,null,null,null,null,null,null,null,null,null,null,null,null,null,null,null,null,null,null,null,null,null,null,null,null,null,null,null,null,null,null,null,null,null,null,null,null,null,null,null,null,null,null,null,null,null,null,null,null,null,null,null,null,null,null,null,null,null,null,null,null,null,null,null,null,null,null,null,null,null,null,null,null,null,null,null,null,null,null,null,null,null,null,null,null,null,null,null,null,null,null,null,null,null,null,null,null,null,null,null,null,null,null,null,null,null,null,null,null,null,null,null,null,null,null,null,null,null,null,null,null,null,null,null,null,null,null,null,null,null,null,null,null,null,null,null,null,null,null,null,null,null,null,null,null,null,null,null,null,null,null,null,null,null,null,null,null,null,null,null,null,null,null,null,null,null,null,null,null,null,null,null,null,null,null,null,null,null,null,null,null,null,null,null,null,null,null,null,null,null,null,null,null,null,null,null,null,null,null,null,null,null,null,null,null,null,null,null,null,null,null,null,null,null,null,null,null,null,null,null,null,null,null,null,null,null,null,null,null,null,null,null,null,null,null,null,null,null,null,null,null,null,null,null,null,null,null,null,null,null,null,null,null,null,null,null,null,null,null,null,null,null,null,null,null,null,null,null,null,null,null,null,null,null,null,null,null,null,null,null,null,null,null,null,null,null,null,null,null,null,null,null,null,null,null,null,null,null,null,null,null,null,null,null,null,null,null,null,null,null,null,null,null,null,null,null,null,null,null,null,null,null,null,null,null,null,null,null,null,null,null,null,null,null,null,null,null,null,null,null,null,null,null,null,null,null,null,null,null,null,null,null,null,null,null,null,null,null,null,null,null,null,null,null,null,null,null,null,null,null,null,null,null,null,null,null,null,null,null,null,null,null,null,null,null,null,null,null,null,null,null,null,null,null,null,null,null,null,null,null,null,null,null,null,null,null,null,null,null,null,null,null,null,null,null,null,null,null,null,null,null,null,null,null,null,null,null,null,null,null,null,null,null,null,null,null,null,null,null,null,null,null,null,null,null,null,null,null,null,null,null,null,null,null,null,null,null,null,null,null,null,null,null,null,null,null,null,null,null,null,null,null,null,null,null,null,null,null,null,null,null,null,null,null,null,null,null,null,null,null,null,null,null,null,null,null,null,null,null,null,null,null,null,null,null,null,null,null,null,null,null,null,null,null,null,null,null,null,null,null,null,null,null,null,null,null,null,null,null,null,null,null,null,null,null,null,null,null,null,null,null,null,null,null,null,null,null,null,null,null,null,null,null,null,null,null,null,null,null,null,null,null,null,null,null,null,null,null,null,null,null,null,null,null,null,null,null,null,null,null,null,null,null,null,null,null,null,null,null,null,null,null,null,null,null,null,null,null,null,null,null,null,null,null,null,null,null,null,null,null,null,null,null,null,null,null,null,null,null,null,null,null,null,null,null,null,null,null,null,null,null,null,null,null,null,null,null,null,null,null,null,null,null,null,null,null,null,null,null,null,null,null,null,null,null,null,null,null,null,null,null,null,null,null,null,null,null,null,null,null,null,null,null,null,null,null,null,null,null,null,null,null,null,null,null,null,null,null,null,null,null,null,null,null,null,null,null,null,null,null,null,null,null,null,null,null,null,null,null,null,null,null,null,null,null,null,null,null,null,null,null,null,null,null,null,null,null,null,null,null,null,null,null,null,null,null,null,null,null,null,null,null,null,null,null,null,null,null,null,null,null,null,null,null,null,null,null,null,null,null,null,null,null,null,null,null,null,null,null,null,null,null,null,null,null,null,null,null,null,null,null,null,null,null,null,null,null,null,null,null,null,null,null,null,null,null,null,null,null,null,null,null,null,null,null,null,null,null,null,null,null,null,null,null,null,null,null,null,null,null,null,null,null,null,null,null,null,null,null,null,null,null,null,null,null,null,null,null,null,null,null,null,null,null,null,null,null,null,null,null,null,null,null,null,null,null,null,null,null,null,null,null,null,null,null,null,null,null,null,null,null,null,null,null,null,null,null,null,null,null,null,null,null,null,null,null,null,null,null,null,null,null,null,null,null,null,null,null,null,null,null,null,null,null,null,null,null,null,null,null,null,null,null,null,null,null,null,null,null,null,null,null,null,null,null,null,null,null,null,null,null,null,null,null,null,null,null,null,null,null,null,null,null,null,null,null,null,null,null,null,null,null,null,null,null,null,null,null,null,null,null,null,null,null,null,null,null,null,null,null,null,null,null,null,null,null,null,null,null,null,null,null,null,null,null,null,null,null,null,null,null,null,null,null,null,null,null,null,null,null,null,null,null,null,null,null,null,null,null,null,null,null,null,null,null,null,null,null,null,null,null,null,null,null,null,null,null,null,null,null,null,null,null,null,null,null,null,null,null,null,null,null,null,null,null,null,null,null,null,null,null,null,null,null,null,null,null,null,null,null,null,null,null,null,null,null,null,null,null,null,null,null,null,null,null,null,null,null,null,null,null,null,null,null,null,null,null,null,null,null,null,null,null,null,null,null,null,null,null,null,null,null,null,null,null,null,null,null,null,null,null,null,null,null,null,null,null,null,null,null,null,null,null,null,null,null,null,null,null,null,null,null,null,null,null,null,null,null,null,null,null,null,null,null,null,null,null,null,null,null,null,null,null,null,null,null,null,null,null,null,null,null,null,null,null,null,null,null,null,null,null,null,null,null,null,null,null,null,null,null,null,null,null,null,null,null,null,null,null,null,null,null,null,null,null,null,null,null,null,null,null,null,null,null,null,null,null,null,null,null,null,null,null,null,null,null,null,null,null,null,null,null,null,null,null,null,null,null,null,null,null,null,null,null,null,null,null,null,null,null,null,null,null,null,null,null,null,null,null,null,null,null,null,null,null,null,null,null,null,null,null,null,null,null,null,null,null,null,null,null,null,null,null,null,null,null,null,null,null,null,null,null,null,null,null,null,null,null,null,null,null,null,null,null,null,null,null,null,null,null,null,null,null,null,null,null,null,null,null,null,null,null,null,null,null,null,null,null,null,null,null,null,null,null,null,null,null,null,null,null,null,null,null,null,null,null,null,null,null,null,null,null,null,null,null,null,null,null,null,null,null,null,null,null,null,null,null,null,null,null,null,null,null,null,null,null,null,null,null,null,null,null,null,null,null,null,null,null,null,null,null,null,null,null,null,null,null,null,null,null,null,null,null,null,null,null,null,null,null,null,null,null,null,null,null,null,null,null,null,null,null,null,null,null,null,null,null,null,null,null,null,null,null,null,null,null,null,null,null,null,null,null,null,null,null,null,null,null,null,null,null,null,null,null,null,null,null,null,null,null,null,null,null,null,null,null,null,null,null,null,null,null,null,null,null,null,null,null,null,null,null,null,null,null,null,null,null,null,null,null,null,null,null,null,null,null,null,null,null,null,null,null,null,null,null,null,null,null,null,null,null,null,null,null,null,null,null,null,null,null,null,null,null,null,null,null,null,null,null,null,null,null,null,null,null,null,null,null,null,null,null,null,null,null,null,null,null,null,null,null,null,null,null,null,null,null,null,null,null,null,null,null,null,null,null,null,null,null,null,null,null,null,null,null,null,null,null,null,null,null,null,null,null,null,null,null,null,null,null,null,null,null,null,null,null,null,null,null,null,null,null,null,null,null,null,null,null,null,null,null,null,null,null,null,null,null,null,null,null,null,null,null,null,null,null,null,null,null,null,null,null,null,null,null,null,null,null,null,null,null,null,null,null,null,null,null,null,null,null,null,null,null,null,null,null,null,null,null,null,null,null,null,null,null,null,null,null,null,null,null,null,null,null,null,null,null,null,null,null,null,null,null,null,null,null,null,null,null,null,null,null,null,null,null,null,null,null,null,null,null,null,null,null,null,null,null,null,null,null,null,null,null,null,null,null,null,null,null,null,null,null,null,null,null,null,null,null,null,null,null,null,null,null,null,null,null,null,null,null,null,null,null,null,null,null,null,null,null,null,null,null,null,null,null,null,null,null,null,null,null,null,null,null,null,null,null,null,null,null,null,null,null,null,null,null,null,null,null,null,null,null,null,null,null,null,null,null,null,null,null,null,null,null,null,null,null,null,null,null,null,null,null,null,null,null,null,null,null,null,null,null,null,null,null,null,null,null,null,null,null,null,null,null,null,null,null,null,null,null,null,null,null,null,null,null,null,null,null,null,null,null,null,null,null,null,null,null,null,null,null,null,null,null,null,null,null,null,null,null,null,null,null,null,null,null,null,null,null,null,null,null,null,null,null,null,null,null,null,null,null,null,null,null,null,null,null,null,null,null,null,null,null,null,null,null,null,null,null,null,null,null,null,null,null,null,null,null,null,null,null,null,null,null,null,null,null,null,null,null,null,null,null,null,null,null,null,null,null,null,null,null,null,null,null,null,null,null,null,null,null,null,null,null,null,null,null,null,null,null,null,null,null,null,null,null,null,null,null,null,null,null,null,null,null,null,null,null,null,null,null,null,null,null,null,null,null,null,null,null,null,null,null,null,null,null,null,null,null,null,null,null,null,null,null,null,null,null,null,null,null,null,null,null,null,null,null,null,null,null,null,null,null,null,null,null,null,null,null,null,null,null,null,null,null,null,null,null,null,null,null,null,null,null,null,null,null,null,null,null,null,null,null,null,null,null,null,null,null,null,null,null,null,null,null,null,null,null,null,null,null,null,null,null,null,null,null,null,null,null,null,null,null,null,null,null,null,null,null,null,null,null,null,null,null,null,null,null,null,null,null,null,null,null,null,null,null,null,null,null,null,null,null,null,null,null,null,null,null,null,null,null,null,null,null,null,null,null,null,null,null,null,null,null,null,null,null,null,null,null,null,null,null,null,null,null,null,null,null,null,null,null,null,null,null,null,null,null,null,null,null,null,null,null,null,null,null,null,null,null,null,null,null,null,null,null,null,null,null,null,null,null,null,null,null,null,null,null,null,null,null,null,null,null,null,null,null,null,null,null,null,null,null,null,null,null,null,null,null,null,null,null,null,null,null,null,null,null,null,null,null,null,null,null,null,null,null,null,null,null,null,null,null,null,null,null,null,null,null,null,null,null,null,null,null,null,null,null,null,null,null,null,null,null,null,null,null,null,null,null,null,null,null,null,null,null,null,null,null,null,null,null,null,null,null,null,null,null,null,null,null,null,null,null,null,null,null,null,null,null,null,null,null,null,null,null,null,null,null,null,null,null,null,null,null,null,null,null,null,null,null,null,null,null,null,null,null,null,null,null,null,null,null,null,null,null,null,null,null,null,null,null,null,null,null,null,null,null,null,null,null,null,null,null,null,null,null,null,null,null,null,null,null,null,null,null,null,null,null,null,null,null,null,null,null,null,null,null,null,null,null,null,null,null,null,null,null,null,null,null,null,null,null,null,null,null,null,null,null,null,null,null,null,null,null,null,null,null,null,null,null,null,null,null,null,null,null,null,null,null,null,null,null,null,null,null,null,null,null,null,null,null,null,null,null,null,null,null,null,null,null,null,null,null,null,null,null,null,null,null,null,null,null,null,null,null,null,null,null,null,null,null,null,null,null,null,null,null,null,null,null,null,null,null,null,null,null,null,null,null,null,null,null,null,null,null,null,null,null,null,null,null,null,null,null,null,null,null,null,null,null,null,null,null,null,null,null,null,null,null,null,null,null,null,null,null,null,null,null,null,null,null,null,null,null,null,null,null,null,null,null,null,null,null,null,null,null,null,null,null,null,null,null,null,null,null,null,null,null,null,null,null,null,null,null,null,null,null,null,null,null,null,null,null,null,null,null,null,null,null,null,null,null,null,null,null,null,null,null,null,null,null,null,null,null,null,null,null,null,null,null,null,null,null,null,null,null,null,null,null,null,null,null,null,null,null,null,null,null,null,null,null,null,null,null,null,null,null,null,null,null,null,null,null,null,null,null,null,null,null,null,null,null,null,null,null,null,null,null,null,null,null,null,null,null,null,null,null,null,null,null,null,null,null,null,null,null,null,null,null,null,null,null,null,null,null,null,null,null,null,null,null,null,null,null,null,null,null,null,null,null,null,null,null,null,null,null,null,null,null,null,null,null,null,null,null,null,null,null,null,null,null,null,null,null,null,null,null,null,null,null,null,null,null,null,null,null,null,null,null,null,null,null,null,null,null,null,null,null,null,null,null,null,null,null,null,null,null,null,null,null,null,null,null,null,null,null,null,null,null,null,null,null,null,null,null,null,null,null,null,null,null,null,null,null,null,null,null,null,null,null,null,null,null,null,null,null,null,null,null,null,null,null,null,null,null,null,null,null,null,null,null,null,null,null,null,null,null,null,null,null,null,null,null,null,null,null,null,null,null,null,null,null,null,null,null,null,null,null,null,null,null,null,null,null,null,null,null,null,null,null,null,null,null,null,null,null,null,null,null,null,null,null,null,null,null,null,null,null,null,null,null,null,null,null,null,null,null,null,null,null,null,null,null,null,null,null,null,null,null,null,null,null,null,null,null,null,null,null,null,null,null,null,null,null,null,null,null,null,null,null,null,null,null,null,null,null,null,null,null,null,null,null,null,null,null,null,null,null,null,null,null,null,null,null,null,null,null,null,null,null,null,null,null,null,null,null,null,null,null,null,null,null,null,null,null,null,null,null,null,null,null,null,null,null,null,null,null,null,null,null,null,null,null,null,null,null,null,null,null,null,null,null,null,null,null,null,null,null,null,null,null,null,null,null,null,null,null,null,null,null,null,null,null,null,null,null,null,null,null,null,null,null,null,null,null,null,null,null,null,null,null,null,null,null,null,null,null,null,null,null,null,null,null,null,null,null,null,null,null,null,null,null,null,null,null,null,null,null,null,null,null,null,null,null,null,null,null,null,null,null,null,null,null,null,null,null,null,null,null,null,null,null,null,null,null,null,null,null,null,null,null,null,null,null,null,null,null,null,null,null,null,null,null,null,null,null,null,null,null,null,null,null,null,null,null,null,null,null,null,null,null,null,null,null,null,null,null,null,null,null,null,null,null,null,null,null,null,null,null,null,null,null,null,null,null,null,null,null,null,null,null,null,null,null,null,null,null,null,null,null,null,null,null,null,null,null,null,null,null,null,null,null,null,null,null,null,null,null,null,null,null,null,null,null,null,null,null,null,null,null,null,null,null,null,null,null,null,null,null,null,null,null,null,null,null,null,null,null,null,null,null,null,null,null,null,null,null,null,null,null,null,null,null,null,null,null,null,null,null,null,null,null,null,null,null,null,null,null,null,null,null,null,null,null,null,null,null,null,null,null,null,null,null,null,null,null,null,null,null,null,null,null,null,null,null,null,null,null,null,null,null,null,null,null,null,null,null,null,null,null,null,null,null,null,null,null,null,null,null,null,null,null,null,null,null,null,null,null,null,null,null,null,null,null,null,null,null,null,null,null,null,null,null,null,null,null,null,null,null,null,null,null,null,null,null,null,null,null,null,null,null,null,null,null,null,null,null,null,null,null,null,null,null,null,null,null,null,null,null,null,null,null,null,null,null,null,null,null,null,null,null,null,null,null,null,null,null,null,null,null,null,null,null,null,null,null,null,null,null,null,null,null,null,null,null,null,null,null,null,null,null,null,null,null,null,null,null,null,null,null,null,null,null,null,null,null,null,null,null,null,null,null,null,null,null,null,null,null,null,null,null,null,null,null,null,null,null,null,null,null,null,null,null,null,null,null,null,null,null,null,null,null,null,null,null,null,null,null,null,null,null,null,null,null,null,null,null,null,null,null,null,null,null,null,null,null,null,null,null,null,null,null,null,null,null,null,null,null,null,null,null,null,null,null,null,null,null,null,null,null,null,null,null,null,null,null,null,null,null,null,null,null,null,null,null,null,null,null,null,null,null,null,null,null,null,null,null,null,null,null,null,null,null,null,null,null,null,null,null,null,null,null,null,null,null,null,null,null,null,null,null,null,null,null,null,null,null,null,null,null,null,null,null,null,null,null,null,null,null,null,null,null,null,null,null,null,null,null,null,null,null,null,null,null,null,null,null,null,null,null,null,null,null,null,null,null,null,null,null,null,null,null,null,null,null,null,null,null,null,null,null,null,null,null,null,null,null,null,null,null,null,null,null,null,null,null,null,null,null,null,null,null,null,null,null,null,null,null,null,null,null,null,null,null,null,null,null,null,null,null,null,null,null,null,null,null,null,null,null,null,null,null,null,null,null,null,null,null,null,null,null,null,null,null,null,null,null,null,null,null,null,null,null,null,null,null,null,null,null,null,null,null,null,null,null,null,null,null,null,null,null,null,null,null,null,null,null,null,null,null,null,null,null,null,null,null,null,null,null,null,null,null,null,null,null,null,null,null,null,null,null,null,null,null,null,null,null,null,null,null,null,null,null,null,null,null,null,null,null,null,null,null,null,null,null,null,null,null,null,null,null,null,null,null,null,null,null,null,null,null,null,null,null,null,null,null,null,null,null,null,null,null,null,null,null,null,null,null,null,null,null,null,null,null,null,null,null,null,null,null,null,null,null,null,null,null,null,null,null,null,null,null,null,null,null,null,null,null,null,null,null,null,null,null,null,null,null,null,null,null,null,null,null,null,null,null,null,null,null,null,null,null,null,null,null,null,null,null,null,null,null,null,null,null,null,null,null,null,null,null,null,null,null,null,null,null,null,null,null,null,null,null,null,null,null,null,null,null,null,null,null,null,null,null,null,null,null,null,null,null,null,null,null,null,null,null,null,null,null,null,null,null,null,null,null,null,null,null,null,null,null,null,null,null,null,null,null,null,null,null,null,null,null,null,null,null,null,null,null,null,null,null,null,null,null,null,null,null,null,null,null,null,null,null,null,null,null,null,null,null,null,null,null,null,null,null,null,null,null,null,null,null,null,null,null,null,null,null,null,null,null,null,null,null,null,null,null,null,null,null,null,null,null,null,null,null,null,null,null,null,null,null,null,null,null,null,null,null,null,null,null,null,null,null,null,null,null,null,null,null,null,null,null,null,null,null,null,null,null,null,null,null,null,null,null,null,null,null,null,null,null,null,null,null,null,null,null,null,null,null,null,null,null,null,null,null,null,null,null,null,null,null,null,null,null,null,null,null,null,null,null,null,null,null,null,null,null,null,null,null,null,null,null,null,null,null,null,null,null,null,null,null,null,null,null,null,null,null,null,null,null,null,null,null,null,null,null,null,null,null,null,null,null,null,null,null,null,null,null,null,null,null,null,null,null,null,null,null,null,null,null,null,null,null,null,null,null,null,null,null,null,null,null,null,null,null,null,null,null,null,null,null,null,null,null,null,null,null,null,null,null,null,null,null,null,null,null,null,null,null,null,null,null,null,null,null,null,null,null,null,null,null,null,null,null,null,null,null,null,null,null,null,null,null,null,null,null,null,null,null,null,null,null,null,null,null,null,null,null,null,null,null,null,null,null,null,null,null,null,null,null,null,null,null,null,null,null,null,null,null,null,null,null,null,null,null,null,null,null,null,null,null,null,null,null,null,null,null,null,null,null,null,null,null,null,null,null,null,null,null,null,null,null,null,null,null,null,null,null,null,null,null,null,null,null,null,null,null,null,null,null,null,null,null,null,null,null,null,null,null,null,null,null,null,null,null,null,null,null,null,null,null,null,null,null,null,null,null,null,null,null,null,null,null,null,null,null,null,null,null,null,null,null,null,null,null,null,null,null,null,null,null,null,null,null,null,null,null,null,null,null,null,null,null,null,null,null,null,null,null,null,null,null,null,null,null,null,null,null,null,null,null,null,null,null,null,null,null,null,null,null,null,null,null,null,null,null,null,null,null,null,null,null,null,null,null,null,null,null,null,null,null,null,null,null,null,null,null,null,null,null,null,null,null,null,null,null,null,null,null,null,null,null,null,null,null,null,null,null,null,null,null,null,null,null,null,null,null,null,null,null,null,null,null,null,null,null,null,null,null,null,null,null,null,null,null,null,null,null,null,null,null,null,null,null,null,null,null,null,null,null,null,null,null,null,null,null,null,null,null,null,null,null,null,null,null,null,null,null,null,null,null,null,null,null,null,null,null,null,null,null,null,null,null,null,null,null,null,null,null,null,null,null,null,null,null,null,null,null,null,null,null,null,null,null,null,null,null,null,null,null,null,null,null,null,null,null,null,null,null,null,null,null,null,null,null,null,null,null,null,null,null,null,null,null,null,null,null,null,null,null,null,null,null,null,null,null,null,null,null,null,null,null,null,null,null,null,null,null,null,null,null,null,null,null,null,null,null,null,null,null,null,null,null,null,null,null,null,null,null,null,null,null,null,null,null,null,null,null,null,null,null,null,null,null,null,null,null,null,null,null,null,null,null,null,null,null,null,null,null,null,null,null,null,null,null,null,null,null,null,null,null,null,null,null,null,null,null,null,null,null,null,null,null,null,null,null,null,null,null,null,null,null,null,null,null,null,null,null,null,null,null,null,null,null,null,null,null,null,null,null,null,null,null,null,null,null,null,null,null,null,null,null,null,null,null,null,null,null,null,null,null,null,null,null,null,null,null,null,null,null,null,null,null,null,null,null,null,null,null,null,null,null,null,null,null,null,null,null,null,null,null,null,null,null,null,null,null,null,null,null,null,null,null,null,null,null,null,null,null,null,null,null,null,null,null,null,null,null,null,null,null,null,null,null,null,null,null,null,null,null,null,null,null,null,null,null,null,null,null,null,null,null,null,null,null,null,null,null,null,null,null,null,null,null,null,null,null,null,null,null,null,null,null,null,null,null,null,null,null,null,null,null,null,null,null,null,null,null,null,null,null,null,null,null,null,null,null,null,null,null,null,null,null,null,null,null,null,null,null,null,null,null,null,null,null,null,null,null,null,null,null,null,null,null,null,null,null,null,null,null,null,null,null,null,null,null,null,null,null,null,null,null,null,null,null,null,null,null,null,null,null,null,null,null,null,null,null,null,null,null,null,null,null,null,null,null,null,null,null,null,null,null,null,null,null,null,null,null,null,null,null,null,null,null,null,null,null,null,null,null,null,null,null,null,null,null,null,null,null,null,null,null,null,null,null,null,null,null,null,null,null,null,null,null,null,null,null,null,null,null,null,null,null,null,null,null,null,null,null,null,null,null,null,null,null,null,null,null,null,null,null,null,null,null,null,null,null,null,null,null,null,null,null,null,null,null,null,null,null,null,null,null,null,null,null,null,null,null,null,null,null,null,null,null,null,null,null,null,null,null,null,null,null,null,null,null,null,null,null,null,null,null,null,null,null,null,null,null,null,null,null,null,null,null,null,null,null,null,null,null,null,null,null,null,null,null,null,null,null,null,null,null,null,null,null,null,null,null,null,null,null,null,null,null,null,null,null,null,null,null,null,null,null,null,null,null,null,null,null,null,null,null,null,null,null,null,null,null,null,null,null,null,null,null,null,null,null,null,null,null,null,null,null,null,null,null,null,null,null,null,null,null,null,null,null,null,null,null,null,null,null,null,null,null,null,null,null,null,null,null,null,null,null,null,null,null,null,null,null,null,null,null,null,null,null,null,null,null,null,null,null,null,null,null,null,null,null,null,null,null,null,null,null,null,null,null,null,null,null,null,null,null,null,null,null,null,null,null,null,null,null,null,null,null,null,null,null,null,null,null,null,null,null,null,null,null,null,null,null,null,null,null,null,null,null,null,null,null,null,null,null,null,null,null,null,null,null,null,null,null,null,null,null,null,null,null,null,null,null,null,null,null,null,null,null,null,null,null,null,null,null,null,null,null,null,null,null,null,null,null,null,null,null,null,null,null,null,null,null,null,null,null,null,null,null,null,null,null,null,null,null,null,null,null,null,null,null,null,null,null,null,null,null,null,null,null,null,null,null,null,null,null,null,null,null,null,null,null,null,null,null,null,null,null,null,null,null,null,null,null,null,null,null,null,null,null,null,null,null,null,null,null,null,null,null,null,null,null,null,null,null,null,null,null,null,null,null,null,null,null,null,null,null,null,null,null,null,null,null,null,null,null,null,null,null,null,null,null,null,null,null,null,null,null,null,null,null,null,null,null,null,null,null,null,null,null,null,null,null,null,null,null,null,null,null,null,null,null,null,null,null,null,null,null,null,null,null,null,null,null,null,null,null,null,null,null,null,null,null,null,null,null,null,null,null,null,null,null,null,null,null,null,null,null,null,null,null,null,null,null,null,null,null,null,null,null,null,null,null,null,null,null,null,null,null,null,null,null,null,null,null,null,null,null,null,null,null,null,null,null,null,null,null,null,null,null,null,null,null,null,null,null,null,null,null,null,null,null,null,null,null,null,null,null,null,null,null,null,null,null,null,null,null,null,null,null,null,null,null,null,null,null,null,null,null,null,null,null,null,null,null,null,null,null,null,null,null,null,null,null,null,null,null,null,null,null,null,null,null,null,null,null,null,null,null,null,null,null,null,null,null,null,null,null,null,null,null,null,null,null,null,null,null,null,null,null,null,null,null,null,null,null,null,null,null,null,null,null,null,null,null,null,null,null,null,null,null,null,null,null,null,null,null,null,null,null,null,null,null,null,null,null,null,null,null,null,null,null,null,null,null,null,null,null,null,null,null,null,null,null,null,null,null,null,null,null,null,null,null,null,null,null,null,null,null,null,null,null,null,null,null,null,null,null,null,null,null,null,null,null,null,null,null,null,null,null,null,null,null,null,null,null,null,null,null,null,null,null,null,null,null,null,null,null,null,null,null,null,null,null,null,null,null,null,null,null,null,null,null,null,null,null,null,null,null,null,null,null,null,null,null,null,null,null,null,null,null,null,null,null,null,null,null,null,null,null,null,null,null,null,null,null,null,null,null,null,null,null,null,null,null,null,null,null,null,null,null,null,null,null,null,null,null,null,null,null,null,null,null,null,null,null,null,null,null,null,null,null,null,null,null,null,null,null,null,null,null,null,null,null,null,null,null,null,null,null,null,null,null,null,null,null,null,null,null,null,null,null,null,null,null,null,null,null,null,null,null,null,null,null,null,null,null,null,null,null,null,null,null,null,null,null,null,null,null,null,null,null,null,null,null,null,null,null,null,null,null,null,null,null,null,null,null,null,null,null,null,null,null,null,null,null,null,null,null,null,null,null,null,null,null,null,null,null,null,null,null,null,null,null,null,null,null,null,null,null,null,null,null,null,null,null,null,null,null,null,null,null,null,null,null,null,null,null,null,null,null,null,null,null,null,null,null,null,null,null,null,null,null,null,null,null,null,null,null,null,null,null,null,null,null,null,null,null,null,null,null,null,null,null,null,null,null,null,null,null,null,null,null,null,null,null,null,null,null,null,null,null,null,null,null,null,null,null,null,null,null,null,null,null,null,null,null,null,null,null,null,null,null,null,null,null,null,null,null,null,null,null,null,null,null,null,null,null,null,null,null,null,null,null,null,null,null,null,null,null,null,null,null,null,null,null,null,null,null,null,null,null,null,null,null,null,null,null,null,null,null,null,null,null,null,null,null,null,null,null,null,null,null,null,null,null,null,null,null,null,null,null,null,null,null,null,null,null,null,null,null,null,null,null,null,null,null,null,null,null,null,null,null,null,null,null,null,null,null,null,null,null,null,null,null,null,null,null,null,null,null,null,null,null,null,null,null,null,null,null,null,null,null,null,null,null,null,null,null,null,null,null,null,null,null,null,null,null,null,null,null,null,null,null,null,null,null,null,null,null,null,null,null,null,null,null,null,null,null,null,null,null,null,null,null,null,null,null,null,null,null,null,null,null,null,null,null,null,null,null,null,null,null,null,null,null,null,null,null,null,null,null,null,null,null,null,null,null,null,null,null,null,null,null,null,null,null,null,null,null,null,null,null,null,null,null,null,null,null,null,null,null,null,null,null,null,null,null,null,null,null,null,null,null,null,null,null,null,null,null,null,null,null,null,null,null,null,null,null,null,null,null,null,null,null,null,null,null,null,null,null,null,null,null,null,null,null,null,null,null,null,null,null,null,null,null,null,null,null,null,null,null,null,null,null,null,null,null,null,null,null,null,null,null,null,null,null,null,null,null,null,null,null,null,null,null,null,null,null,null,null,null,null,null,null,null,null,null,null,null,null,null,null,null,null,null,null,null,null,null,null,null,null,null,null,null,null,null,null,null,null,null,null,null,null,null,null,null,null,null,null,null,null,null,null,null,null,null,null,null,null,null,null,null,null,null,null,null,null,null,null,null,null,null,null,null,null,null,null,null,null,null,null,null,null,null,null,null,null,null,null,null,null,null,null,null,null,null,null,null,null,null,null,null,null,null,null,null,null,null,null,null,null,null,null,null,null,null,null,null,null,null,null,null,null,null,null,null,null,null,null,null,null,null,null,null,null,null,null,null,null,null,null,null,null,null,null,null,null,null,null,null,null,null,null,null,null,null,null,null,null,null,null,null,null,null,null,null,null,null,null,null,null,null,null,null,null,null,null,null,null,null,null,null,null,null,null,null,null,null,null,null,null,null,null,null,null,null,null,null,null,null,null,null,null,null,null,null,null,null,null,null,null,null,null,null,null,null,null,null,null,null,null,null,null,null,null,null,null,null,null,null,null,null,null,null,null,null,null,null,null,null,null,null,null,null,null,null,null,null,null,null,null,null,null,null,null,null,null,null,null,null,null,null,null,null,null,null,null,null,null,null,null,null,null,null,null,null,null,null,null,null,null,null,null,null,null,null,null,null,null,null,null,null,null,null,null,null,null,null,null,null,null,null,null,null,null,null,null,null,null,null,null,null,null,null,null,null,null,null,null,null,null,null,null,null,null,null,null,null,null,null,null,null,null,null,null,null,null,null,null,null,null,null,null,null,null,null,null,null,null,null,null,null,null,null,null,null,null,null,null,null,null,null,null,null,null,null,null,null,null,null,null,null,null,null,null,null,null,null,null,null,null,null,null,null,null,null,null,null,null,null,null,null,null,null,null,null,null,null,null,null,null,null,null,null,null,null,null,null,null,null,null,null,null,null,null,null,null,null,null,null,null,null,null,null,null,null,null,null,null,null,null,null,null,null,null,null,null,null,null,null,null,null,null,null,null,null,null,null,null,null,null,null,null,null,null,null,null,null,null,null,null,null,null,null,null,null,null,null,null,null,null,null,null,null,null,null,null,null,null,null,null,null,null,null,null,null,null,null,null,null,null,null,null,null,null,null,null,null,null,null,null,null,null,null,null,null,null,null,null,null,null,null,null,null,null,null,null,null,null,null,null,null,null,null,null,null,null,null,null,null,null,null,null,null,null,null,null,null,null,null,null,null,null,null,null,null,null,null,null,null,null,null,null,null,null,null,null,null,null,null,null,null,null,null,null,null,null,null,null,null,null,null,null,null,null,null,null,null,null,null,null,null,null,null,null,null,null,null,null,null,null,null,null,null,null,null,null,null,null,null,null,null,null,null,null,null,null,null,null,null,null,null,null,null,null,null,null,null,null,null,null,null,null,null,null,null,null,null,null,null,null,null,null,null,null,null,null,null,null,null,null,null,null,null,null,null,null,null,null,null,null,null,null,null,null,null,null,null,null,null,null,null,null,null,null,null,null,null,null,null,null,null,null,null,null,null,null,null,null,null,null,null,null,null,null,null,null,null,null,null,null,null,null,null,null,null,null,null,null,null,null,null,null,null,null,null,null,null,null,null,null,null,null,null,null,null,null,null,null,null,null,null,null,null,null,null,null,null,null,null,null,null,null,null,null,null,null,null,null,null,null,null,null,null,null,null,null,null,null,null,null,null,null,null,null,null,null,null,null,null,null,null,null,null,null,null,null,null,null,null,null,null,null,null,null,null,null,null,null,null,null,null,null,null,null,null,null,null,null,null,null,null,null,null,null,null,null,null,null,null,null,null,null,null,null,null,null,null,null,null,null,null,null,null,null,null,null,null,null,null,null,null,null,null,null,null,null,null,null,null,null,null,null,null,null,null,null,null,null,null,null,null,null,null,null,null,null,null,null,null,null,null,null,null,null,null,null,null,null,null,null,null,null,null,null,null,null,null,null,null,null,null,null,null,null,null,null,null,null,null,null,null,null,null,null,null,null,null,null,null,null,null,null,null,null,null,null,null,null,null,null,null,null,null,null,null,null,null,null,null,null,null,null,null,null,null,null,null,null,null,null,null,null,null,null,null,null,null,null,null,null,null,null,null,null,null,null,null,null,null,null,null,null,null,null,null,null,null,null,null,null,null,null,null,null,null,null,null,null,null,null,null,null,null,null,null,null,null,null,null,null,null,null,null,null,null,null,null,null,null,null,null,null,null,null,null,null,null,null,null,null,null,null,null,null,null,null,null,null,null,null,null,null,null,null,null,null,null,null,null,null,null,null,null,null,null,null,null,null,null,null,null,null,null,null,null,null,null,null,null,null,null,null,null,null,null,null,null,null,null,null,null,null,null,null,null,null,null,null,null,null,null,null,null,null,null,null,null,null,null,null,null,null,null,null,null,null,null,null,null,null,null,null,null,null,null,null,null,null,null,null,null,null,null,null,null,null,null,null,null,null,null,null,null,null,null,null,null,null,null,null,null,null,null,null,null,null,null,null,null,null,null,null,null,null,null,null,null,null,null,null,null,null,null,null,null,null,null,null,null,null,null,null,null,null,null,null,null,null,null,null,null,null,null,null,null,null,null,null,null,null,null,null,null,null,null,null,null,null,null,null,null,null,null,null,null,null,null,null,null,null,null,null,null,null,null,null,null,null,null,null,null,null,null,null,null,null,null,null,null,null,null,null,null,null,null,null,null,null,null,null,null,null,null,null,null,null,null,null,null,null,null,null,null,null,null,null,null,null,null,null,null,null,null,null,null,null,null,null,null,null,null,null,null,null,null,null,null,null,null,null,null,null,null,null,null,null,null,null,null,null,null,null,null,null,null,null,null,null,null,null,null,null,null,null,null,null,null,null,null,null,null,null,null,null,null,null,null,null,null,null,null,null,null,null,null,null,null,null,null,null,null,null,null,null,null,null,null,null,null,null,null,null,null,null,null,null,null,null,null,null,null,null,null,null,null,null,null,null,null,null,null,null,null,null,null,null,null,null,null,null,null,null,null,null,null,null,null,null,null,null,null,null,null,null,null,null,null,null,null,null,null,null,null,null,null,null,null,null,null,null,null,null,null,null,null,null,null,null,null,null,null,null,null,null,null,null,null,null,null,null,null,null,null,null,null,null,null,null,null,null,null,null,null,null,null,null,null,null,null,null,null,null,null,null,null,null,null,null,null,null,null,null,null,null,null,null,null,null,null,null,null,null,null,null,null,null,null,null,null,null,null,null,null,null,null,null,null,null,null,null,null,null,null,null,null,null,null,null,null,null,null,null,null,null,null,null,null,null,null,null,null,null,null,null,null,null,null,null,null,null,null,null,null,null,null,null,null,null,null,null,null,null,null,null,null,null,null,null,null,null,null,null,null,null,null,null,null,null,null,null,null,null,null,null,null,null,null,null,null,null,null,null,null,null,null,null,null,null,null,null,null,null,null,null,null,null,null,null,null,null,null,null,null,null,null,null,null,null,null,null,null,null,null,null,null,null,null,null,null,null,null,null,null,null,null,null,null,null,null,null,null,null,null,null,null,null,null,null,null,null,null,null,null,null,null,null,null,null,null,null,null,null,null,null,null,null,null,null,null,null,null,null,null,null,null,null,null,null,null,null,null,null,null,null,null,null,null,null,null,null,null,null,null,null,null,null,null,null,null,null,null,null,null,null,null,null,null,null,null,null,null,null,null,null,null,null,null,null,null,null,null,null,null,null,null,null,null,null,null,null,null,null,null,null,null,null,null,null,null,null,null,null,null,null,null,null,null,null,null,null,null,null,null,null,null,null,null,null,null,null,null,null,null,null,null,null,null,null,null,null,null,null,null,null,null,null,null,null,null,null,null,null,null,null,null,null,null,null,null,null,null,null,null,null,null,null,null,null,null,null,null,null,null,null,null,null,null,null,null,null,null,null,null,null,null,null,null,null,null,null,null,null,null,null,null,null,null,null,null,null,null,null,null,null,null,null,null,null,null,null,null,null,null,null,null,null,null,null,null,null,null,null,null,null,null,null,null,null,null,null,null,null,null,null,null,null,null,null,null,null,null,null,null,null,null,null,null,null,null,null,null,null,null,null,null,null,null,null,null,null,null,null,null,null,null,null,null,null,null,null,null,null,null,null,null,null,null,null,null,null,null,null,null,null,null,null,null,null,null,null,null,null,null,null,null,null,null,null,null,null,null,null,null,null,null,null,null,null,null,null,null,null,null,null,null,null,null,null,null,null,null,null,null,null,null,null,null,null,null,null,null,null,null,null,null,null,null,null,null,null,null,null,null,null,null,null,null,null,null,null,null,null,null,null,null,null,null,null,null,null,null,null,null,null,null,null,null,null,null,null,null,null,null,null,null,null,null,null,null,null,null,null,null,null,null,null,null,null,null,null,null,null,null,null,null,null,null,null,null,null,null,null,null,null,null,null,null,null,null,null,null,null,null,null,null,null,null,null,null,null,null,null,null,null,null,null,null,null,null,null,null,null,null,null,null,null,null,null,null,null,null,null,null,null,null,null,null,null,null,null,null,null,null,null,null,null,null,null,null,null,null,null,null,null,null,null,null,null,null,null,null,null,null,null,null,null,null,null,null,null,null,null,null,null,null,null,null,null,null,null,null,null,null,null,null,null,null,null,null,null,null,null,null,null,null,null,null,null,null,null,null,null,null,null,null,null,null,null,null,null,null,null,null,null,null,null,null,null,null,null,null,null,null,null,null,null,null,null,null,null,null,null,null,null,null,null,null,null,null,null,null,null,null,null,null,null,null,null,null,null,null,null,null,null,null,null,null,null,null,null,null,null,null,null,null,null,null,null,null,null,null,null,null,null,null,null,null,null,null,null,null,null,null,null,null,null,null,null,null,null,null,null,null,null,null,null,null,null,null,null,null,null,null,null,null,null,null,null,null,null,null,null,null,null,null,null,null,null,null,null,null,null,null,null,null,null,null,null,null,null,null,null,null,null,null,null,null,null,null,null,null,null,null,null,null,null,null,null,null,null,null,null,null,null,null,null,null,null,null,null,null,null,null,null,null,null,null,null,null,null,null,null,null,null,null,null,null,null,null,null,null,null,null,null,null,null,null,null,null,null,null,null,null,null,null,null,null,null,null,null,null,null,null,null,null,null,null,null,null,null,null,null,null,null,null,null,null,null,null,null,null,null,null,null,null,null,null,null,null,null,null,null,null,null,null,null,null,null,null,null,null,null,null,null,null,null,null,null,null,null,null,null,null,null,null,null,null,null,null,null,null,null,null,null,null,null,null,null,null,null,null,null,null,null,null,null,null,null,null,null,null,null,null,null,null,null,null,null,null,null,null,null,null,null,null,null,null,null,null,null,null,null,null,null,null,null,null,null,null,null,null,null,null,null,null,null,null,null,null,null,null,null,null,null,null,null,null,null,null,null,null,null,null,null,null,null,null,null,null,null,null,null,null,null,null,null,null,null,null,null,null,null,null,null,null,null,null,null,null,null,null,null,null,null,null,null,null,null,null,null,null,null,null,null,null,null,null,null,null,null,null,null,null,null,null,null,null,null,null,null,null,null,null,null,null,null,null,null,null,null,null,null,null,null,null,null,null,null,null,null,null,null,null,null,null,null,null,null,null,null,null,null,null,null,null,null,null,null,null,null,null,null,null,null,null,null,null,null,null,null,null,null,null,null,null,null,null,null,null,null,null,null,null,null,null,null,null,null,null,null,null,null,null,null,null,null,null,null,null,null,null,null,null,null,null,null,null,null,null,null,null,null,null,null,null,null,null,null,null,null,null,null,null,null,null,null,null,null,null,null,null,null,null,null,null,null,null,null,null,null,null,null,null,null,null,null,null,null,null,null,null,null,null,null,null,null,null,null,null,null,null,null,null,null,null,null,null,null,null,null,null,null,null,null,null,null,null,null,null,null,null,null,null,null,null,null,null,null,null,null,null,null,null,null,null,null,null,null,null,null,null,null,null,null,null,null,null,null,null,null,null,null,null,null,null,null,null,null,null,null,null,null,null,null,null,null,null,null,null,null,null,null,null,null,null,null,null,null,null,null,null,null,null,null,null,null,null,null,null,null,null,null,null,null,null,null,null,null,null,null,null,null,null,null,null,null,null,null,null,null,null,null,null,null,null,null,null,null,null,null,null,null,null,null,null,null,null,null,null,null,null,null,null,null,null,null,null,null,null,null,null,null,null,null,null,null,null,null,null,null,null,null,null,null,null,null,null,null,null,null,null,null,null,null,null,null,null,null,null,null,null,null,null,null,null,null,null,null,null,null,null,null,null,null,null,null,null,null,null,null,null,null,null,null,null,null,null,null,null,null,null,null,null,null,null,null,null,null,null,null,null,null,null,null,null,null,null,null,null,null,null,null,null,null,null,null,null,null,null,null,null,null,null,null,null,null,null,null,null,null,null,null,null,null,null,null,null,null,null,null,null,null,null,null,null,null,null,null,null,null,null,null,null,null,null,null,null,null,null,null,null,null,null,null,null,null,null,null,null,null,null,null,null,null,null,null,null,null,null,null,null,null,null,null,null,null,null,null,null,null,null,null,null,null,null,null,null,null,null,null,null,null,null,null,null,null,null,null,null,null,null,null,null,null,null,null,null,null,null,null,null,null,null,null,null,null,null,null,null,null,null,null,null,null,null,null,null,null,null,null,null,null,null,null,null,null,null,null,null,null,null,null,null,null,null,null,null,null,null,null,null,null,null,null,null,null,null,null,null,null,null,null,null,null,null,null,null,null,null,null,null,null,null,null,null,null,null,null,null,null,null,null,null,null,null,null,null,null,null,null,null,null,null,null,null,null,null,null,null,null,null,null,null,null,null,null,null,null,null,null,null,null,null,null,null,null,null,null,null,null,null,null,null,null,null,null,null,null,null,null,null,null,null,null,null,null,null,null,null,null,null,null,null,null,null,null,null,null,null,null,null,null,null,null,null,null,null,null,null,null,null,null,null,null,null,null,null,null,null,null,null,null,null,null,null,null,null,null,null,null,null,null,null,null,null,null,null,null,null,null,null,null,null,null,null,null,null,null,null,null,null,null,null,null,null,null,null,null,null,null,null,null,null,null,null,null,null,null,null,null,null,null,null,null,null,null,null,null,null,null,null,null,null,null,null,null,null,null,null,null,null,null,null,null,null,null,null,null,null,null,null,null,null,null,null,null,null,null,null,null,null,null,null,null,null,null,null,null,null,null,null,null,null,null,null,null,null,null,null,null,null,null,null,null,null,null,null,null,null,null,null,null,null,null,null,null,null,null,null,null,null,null,null,null,null,null,null,null,null,null,null,null,null,null,null,null,null,null,null,null,null,null,null,null,null,null,null,null,null,null,null,null,null,null,null,null,null,null,null,null,null,null,null,null,null,null,null,null,null,null,null,null,null,null,null,null,null,null,null,null,null,null,null,null,null,null,null,null,null,null,null,null,null,null,null,null,null,null,null,null,null,null,null,null,null,null,null,null,null,null,null,null,null,null,null,null,null,null,null,null,null,null,null,null,null,null,null,null,null,null,null,null,null,null,null,null,null,null,null,null,null,null,null,null,null,null,null,null,null,null,null,null,null,null,null,null,null,null,null,null,null,null,null,null,null,null,null,null,null,null,null,null,null,null,null,null,null,null,null,null,null,null,null,null,null,null,null,null,null,null,null,null,null,null,null,null,null,null,null,null,null,null,null,null,null,null,null,null,null,null,null,null,null,null,null,null,null,null,null,null,null,null,null,null,null,null,null,null,null,null,null,null,null,null,null,null,null,null,null,null,null,null,null,null,null,null,null,null,null,null,null,null,null,null,null,null,null,null,null,null,null,null,null,null,null,null,null,null,null,null,null,null,null,null,null,null,null,null,null,null,null,null,null,null,null,null,null,null,null,null,null,null,null,null,null,null,null,null,null,null,null,null,null,null,null,null,null,null,null,null,null,null,null,null,null,null,null,null,null,null,null,null,null,null,null,null,null,null,null,null,null,null,null,null,null,null,null,null,null,null,null,null,null,null,null,null,null,null,null,null,null,null,null,null,null,null,null,null,null,null,null,null,null,null,null,null,null,null,null,null,null,null,null,null,null,null,null,null,null,null,null,null,null,null,null,null,null,null,null,null,null,null,null,null,null,null,null,null,null,null,null,null,null,null,null,null,null,null,null,null,null,null,null,null,null,null,null,null,null,null,null,null,null,null,null,null,null,null,null,null,null,null,null,null,null,null,null,null,null,null,null,null,null,null,null,null,null,null,null,null,null,null,null,null,null,null,null,null,null,null,null,null,null,null,null,null,null,null,null,null,null,null,null,null,null,null,null,null,null,null,null,null,null,null,null,null,null,null,null,null,null,null,null,null,null,null,null,null,null,null,null,null,null,null,null,null,null,null,null,null,null,null,null,null,null,null,null,null,null,null,null,null,null,null,null,null,null,null,null,null,null,null,null,null,null,null,null,null,null,null,null,null,null,null,null,null,null,null,null,null,null,null,null,null,null,null,null,null,null,null,null,null,null,null,null,null,null,null,null,null,null,null,null,null,null,null,null,null,null,null,null,null,null,null,null,null,null,null,null,null,null,null,null,null,null,null,null,null,null,null,null,null,null,null,null,null,null,null,null,null,null,null,null,null,null,null,null,null,null,null,null,null,null,null,null,null,null,null,null,null,null,null,null,null,null,null,null,null,null,null,null,null,null,null,null,null,null,null,null,null,null,null,null,null,null,null,null,null,null,null,null,null,null,null,null,null,null,null,null,null,null,null,null,null,null,null,null,null,null,null,null,null,null,null,null,null,null,null,null,null,null,null,null,null,null,null,null,null,null,null,null,null,null,null,null,null,null,null,null,null,null,null,null,null,null,null,null,null,null,null,null,null,null,null,null,null,null,null,null,null,null,null,null,null,null,null,null,null,null,null,null,null,null,null,null,null,null,null,null,null,null,null,null,null,null,null,null,null,null,null,null,null,null,null,null,null,null,null,null,null,null,null,null,null,null,null,null,null,null,null,null,null,null,null,null,null,null,null,null,null,null,null,null,null,null,null,null,null,null,null,null,null,null,null,null,null,null,null,null,null,null,null,null,null,null,null,null,null,null,null,null,null,null,null,null,null,null,null,null,null,null,null,null,null,null,null,null,null,null,null,null,null,null,null,null,null,null,null,null,null,null,null,null,null,null,null,null,null,null,null,null,null,null,null,null,null,null,null,null,null,null,null,null,null,null,null,null,null,null,null,null,null,null,null,null,null,null,null,null,null,null,null,null,null,null,null,null,null,null,null,null,null,null,null,null,null,null,null,null,null,null,null,null,null,null,null,null,null,null,null,null,null,null,null,null,null,null,null,null,null,null,null,null,null,null,null,null,null,null,null,null,null,null,null,null,null,null,null,null,null,null,null,null,null,null,null,null,null,null,null,null,null,null,null,null,null,null,null,null,null,null,null,null,null,null,null,null,null,null,null,null,null,null,null,null,null,null,null,null,null,null,null,null,null,null,null,null,null,null,null,null,null,null,null,null,null,null,null,null,null,null,null,null,null,null,null,null,null,null,null,null,null,null,null,null,null,null,null,null,null,null,null,null,null,null,null,null,null,null,null,null,null,null,null,null,null,null,null,null,null,null,null,null,null,null,null,null,null,null,null,null,null,null,null,null,null,null,null,null,null,null,null,null,null,null,null,null,null,null,null,null,null,null,null,null,null,null,null,null,null,null,null,null,null,null,null,null,null,null,null,null,null,null,null,null,null,null,null,null,null,null,null,null,null,null,null,null,null,null,null,null,null,null,null,null,null,null,null,null,null,null,null,null,null,null,null,null,null,null,null,null,null,null,null,null,null,null,null,null,null,null,null,null,null,null,null,null,null,null,null,null,null,null,null,null,null,null,null,null,null,null,null,null,null,null,null,null,null,null,null,null,null,null,null,null,null,null,null,null,null,null,null,null,null,null,null,null,null,null,null,null,null,null,null,null,null,null,null,null,null,null,null,null,null,{"$f":"IF(C13>=1,\"yes\",\"no\")","v":"no"}]
["Application Parameters"]
["Category","Enter or Select Value","Number of points"]
["Is the planned application a: soil injection; tree injection; chemigation applied subsurface or under impermeable plastic mulch; spot treatment (<1,000 square feet being treated); treatment of the farm/field less than 1/10th of an acre?","make selection",{"$f":"IF(B61=\"yes\",\"No Additional Runoff/Erosion Mitigation Needed\",0)","v":0}]
["Annual application rate reduction (enter % below the maximum labeled annual application rate)",0,{"$f":"IF(AND(B62>=0.1,B62<0.3),1,IF(AND(B62>=0.3,B62<0.6),2,IF(B62>=0.6,3,0)))","v":0}]
["Reduction in the proportion of field treated (enter % field area treated using banded application, partial field treatment, ground precision sprayer, smart sprayer, or other specialized method)",0,{"$f":"IF(AND(B63>=0.1,B63<0.3),2,IF(AND(B63>=0.3,B63<0.6),3,IF(B63>=0.6,4,0)))","v":0}]
["Soil incorporation (watering-in or mechanical incorporation before a runoff producing event; a runoff producing event is considered as follows:  \n- A 50% or greater chance of rainfall of 1 inch or more is expected to occur within 48 hours of the application as predicted by the NOAA/National Weather Service. AND,  \n- The precipitation potential is 50% or greater at any point during the 48-hr period.)","make selection",{"$f":"IF(B64=\"yes\", 1,0)","v":0}]
["Resulting Mitigation Points for the Field and Application Parameters will be Provided in Blue Cells"]
["Does field/management unit need runoff/erosion mitigation?",null,{"$f":"IF(OR(C56=\"No Additional Runoff/Erosion Mitigation Needed - Field/Management Unit Meets Runoff/Erosion Mitigation Requirements\",C67>=9,C61=\"No Additional Runoff/Erosion Mitigation Needed\"),\"No Additional Runoff/Erosion Mitigation Needed - Field/Management Unit Meets Runoff/Erosion Mitigation Requirements\",\"Compare Total Points (Blue Cell below) for the Field/Managment Unit and Applicaiton Parameters to Label Required Points\")","v":"Compare Total Points (Blue Cell below) for the Field/Managment Unit and Applicaiton Parameters to Label Required Points"}]
["Total mitigation points for product or chemical and field/management unit mitigation points",null,{"$f":"SUM(C61:C64,C57)","v":0}]

{"sheet":"(locked calculator functions)","index":2,"n_rows":3110,"n_cols":272,"rows_kept":3110,"cut":false,"hidden":true,"merged":[]}
["Worksheet contains lookup tables for dropdown menus in the calculator.  Do not modify.",null,null,null,null,null,null,null,null,null,null,null,null,"State","County","Credit",null,{"$f":"_xlfn.UNIQUE(tLists4[State])","v":"Alabama"},{"$f":"TRANSPOSE(_xlfn._xlws.FILTER(tLists4[County],tLists4[State]=R1))","v":"Autauga County"},"Baldwin County","Barbour County","Bibb County","Blount County","Bullock County","Butler County","Calhoun County","Chambers County","Cherokee County","Chilton County","Choctaw County","Clarke County","Clay County","Cleburne County","Coffee County","Colbert County","Conecuh County","Coosa County","Covington County","Crenshaw County","Cullman County","Dale County","Dallas County","DeKalb County","Elmore County","Escambia County","Etowah County","Fayette County","Franklin County","Geneva County","Greene County","Hale County","Henry County","Houston County","Jackson County","Jefferson County","Lamar County","Lauderdale County","Lawrence County","Lee County","Limestone County","Lowndes County","Macon County","Madison County","Marengo County","Marion County","Marshall County","Mobile County","Monroe County","Montgomery County","Morgan County","Perry County","Pickens County","Pike County","Randolph County","Russell County","Shelby County","St. Clair County","Sumter County","Talladega County","Tallapoosa County","Tuscaloosa County","Walker County","Washington County","Wilcox County","Winston County"]
[null,"Terrestrial habitat improvement","Adjacent to field carbon amendments","Water Control Systems","Riparian area","Vegetative buffer strip","Irrigation","Reduced Tillage","Cover Crop","Working with a specialist or conservation program","make selection","mulching",null,"Alabama","Autauga County",2,null,"Arizona",{"$f":"TRANSPOSE(_xlfn._xlws.FILTER(tLists4[County],tLists4[State]=R2))","v":"Apache County"},"Cochise County","Coconino County","Gila County","Graham County","Greenlee County","La Paz County","Maricopa County","Mohave County","Navajo County","Pima County","Pinal County","Santa Cruz County","Yavapai County","Yuma County"]
[null,"make selection","make selection","make selection","make selection","make selection","make selection","make selection","make selection",null,"yes","make selection",null,"Alabama","Baldwin County","Not Eligible for Credit",null,"Arkansas",{"$f":"TRANSPOSE(_xlfn._xlws.FILTER(tLists4[County],tLists4[State]=R3))","v":"Arkansas County"},"Ashley County","Baxter County","Benton County","Boone County","Bradley County","Calhoun County","Carroll County","Chicot County","Clark County","Clay County","Cleburne County","Cleveland County","Columbia County","Conway County","Craighead County","Crawford County","Crittenden County","Cross County","Dallas County","Desha County","Drew County","Faulkner County","Franklin County","Fulton County","Garland County","Grant County","Greene County","Hempstead County","Hot Spring County","Howard County","Independence County","Izard County","Jackson County","Jefferson County","Johnson County","Lafayette County","Lawrence County","Lee County","Lincoln County","Little River County","Logan County","Lonoke County","Madison County","Marion County","Miller County","Mississippi County","Monroe County","Montgomery County","Nevada County","Newton County","Ouachita County","Perry County","Phillips County","Pike County","Poinsett County","Polk County","Pope County","Prairie County","Pulaski County","Randolph County","Saline County","Scott County","Searcy County","Sebastian County","Sevier County","Sharp County","St. Francis County","Stone County","Union County","Van Buren County","Washington County","White County","Woodruff County","Yell County"]
[null,"not applicable","not applicable","not applicable","not applicable","not applicable","not applicable","not applicable","not applicable","make selection","no","not applicable",null,"Alabama","Barbour County",2,null,"California",{"$f":"TRANSPOSE(_xlfn._xlws.FILTER(tLists4[County],tLists4[State]=R4))","v":"Alameda County"},"Alpine County","Amador County","Butte County","Calaveras County","Colusa County","Contra Costa County","Del Norte County","El Dorado County","Fresno County","Glenn County","Humboldt County","Imperial County","Inyo County","Kern County","Kings County","Lake County","Lassen County","Los Angeles County","Madera County","Marin County","Mariposa County","Mendocino County","Merced County","Modoc County","Mono County","Monterey County","Napa County","Nevada County","Orange County","Placer County","Plumas County","Riverside County","Sacramento County","San Benito County","San Bernardino County","San Diego County","San Francisco County","San Joaquin County","San Luis Obispo County","San Mateo County","Santa Barbara County","Santa Clara County","Santa Cruz County","Shasta County","Sierra County","Siskiyou County","Solano County","Sonoma County","Stanislaus County","Sutter County","Tehama County","Trinity County","Tulare County","Tuolumne County","Ventura County","Yolo County","Yuba County"]
[null,"20 to <30 ft Terrestrial Landscape/habitat improvement ","Containing Activated Carbon","Irrigation Tailwater Return System","20 to <30 ft Riparian forest buffer, riparian herbaceous cover","20 to <30 ft Vegetative filter strip (VFS), field border","above ground drip tape","Mulch Tillage","long term cover crop no till","Not Applicable",null,"Mulching with artificial materials",null,"Alabama","Bibb County",2,null,"Colorado",{"$f":"TRANSPOSE(_xlfn._xlws.FILTER(tLists4[County],tLists4[State]=R5))","v":"Adams County"},"Alamosa County","Arapahoe County","Archuleta County","Baca County","Bent County","Boulder County","Broomfield County","Chaffee County","Cheyenne County","Clear Creek County","Conejos County","Costilla County","Crowley County","Custer County","Delta County","Denver County","Dolores County","Douglas County","Eagle County","El Paso County","Elbert County","Fremont County","Garfield County","Gilpin County","Grand County","Gunnison County","Hinsdale County","Huerfano County","Jackson County","Jefferson County","Kiowa County","Kit Carson County","La Plata County","Lake County","Larimer County","Las Animas County","Lincoln County","Logan County","Mesa County","Mineral County","Moffat County","Montezuma County","Montrose County","Morgan County","Otero County","Ouray County","Park County","Phillips County","Pitkin County","Prowers County","Pueblo County","Rio Blanco County","Rio Grande County","Routt County","Saguache County","San Juan County","San Miguel County","Sedgwick County","Summit County","Teller County","Washington County","Weld County","Yuma County"]
[null,"30 to <60 ft Terrestrial Landscape/ habitat improvement","Containing Compost","Perimeter Berm System","30 to <60 ft Riparian forest buffer, riparian herbaceous cover ","30 to <60 ft Vegetative filter strip (VFS), field border","below ground drip tape","No Till","short term cover crop no till","Working with a runoff/erosion specialist",null,"Mulching with natural materials",null,"Alabama","Blount County","Not Eligible for Credit",null,"Connecticut",{"$f":"TRANSPOSE(_xlfn._xlws.FILTER(tLists4[County],tLists4[State]=R6))","v":"Capitol Planning Region"},"Greater Bridgeport Planning Region","Lower Connecticut River Valley Planning Region","Naugatuck Valley Planning Region","Northeastern Connecticut Planning Region","Northwest Hills Planning Region","South Central Connecticut Planning Region","Southeastern Connecticut Planning Region","Western Connecticut Planning Region"]
[null,">60 ft Terrestrial Landscape/ habitat improvement",null,"Water Retention Pond",">60 ft Riparian forest buffer, riparian herbaceous cover",">60 ft Vegetative filter strip (VFS), field border","below tarp irrigation","Perennial Crop","tillage used to terminate cover crop","Participating in a qualified conservation program",null,null,null,"Alabama","Bullock County","Not Eligible for Credit",null,"Delaware",{"$f":"TRANSPOSE(_xlfn._xlws.FILTER(tLists4[County],tLists4[State]=R7))","v":"Kent County"},"New Castle County","Sussex County"]
[null,null,null,"Sediment Control Basin",null,null,"drip emitters","Reduced Tillage",null,null,null,null,null,"Alabama","Butler County","Not Eligible for Credit",null,"District of Columbia",{"$f":"TRANSPOSE(_xlfn._xlws.FILTER(tLists4[County],tLists4[State]=R8))","v":"District of Columbia"}]
[null,null,null,"Subsurface or Tile Drainage with Controlled Outlet",null,null,"dry farming","Ridge Tillage",null,null,null,null,null,"Alabama","Calhoun County",2,null,"Florida",{"$f":"TRANSPOSE(_xlfn._xlws.FILTER(tLists4[County],tLists4[State]=R9))","v":"Alachua County"},"Baker County","Bay County","Bradford County","Brevard County","Broward County","Calhoun County","Charlotte County","Citrus County","Clay County","Collier County","Columbia County","DeSoto County","Dixie County","Duval County","Escambia County","Flagler County","Franklin County","Gadsden County","Gilchrist County","Glades County","Gulf County","Hamilton County","Hardee County","Hendry County","Hernando County","Highlands County","Hillsborough County","Holmes County","Indian River County","Jackson County","Jefferson County","Lafayette County","Lake County","Lee County","Leon County","Levy County","Liberty County","Madison County","Manatee County","Marion County","Martin County","Miami-Dade County","Monroe County","Nassau County","Okaloosa County","Okeechobee County","Orange County","Osceola County","Palm Beach County","Pasco County","Pinellas County","Polk County","Putnam County","Santa Rosa County","Sarasota County","Seminole County","St. Johns County","St. Lucie County","Sumter County","Suwannee County","Taylor County","Union County","Volusia County","Wakulla County","Walton County","Washington County"]
[null,null,null,"Subsurface or Tile Drainage without Controlled Outlet",null,null,"micro-sprinklers","Strip Till",null,null,null,null,null,"Alabama","Chambers County",2,null,"Georgia",{"$f":"TRANSPOSE(_xlfn._xlws.FILTER(tLists4[County],tLists4[State]=R10))","v":"Appling County"},"Atkinson County","Bacon County","Baker County","Baldwin County","Banks County","Barrow County","Bartow County","Ben Hill County","Berrien County","Bibb County","Bleckley County","Brantley County","Brooks County","Bryan County","Bulloch County","Burke County","Butts County","Calhoun County","Camden County","Candler County","Carroll County","Catoosa County","Charlton County","Chatham County","Chattahoochee County","Chattooga County","Cherokee County","Clarke County","Clay County","Clayton County","Clinch County","Cobb County","Coffee County","Colquitt County","Columbia County","Cook County","Coweta County","Crawford County","Crisp County","Dade County","Dawson County","Decatur County","DeKalb County","Dodge County","Dooly County","Dougherty County","Douglas County","Early County","Echols County","Effingham County","Elbert County","Emanuel County","Evans County","Fannin County","Fayette County","Floyd County","Forsyth County","Franklin County","Fulton County","Gilmer County","Glascock County","Glynn County","Gordon County","Grady County","Greene County","Gwinnett County","Habersham County","Hall County","Hancock County","Haralson County","Harris County","Hart County","Heard County","Henry County","Houston County","Irwin County","Jackson County","Jasper County","Jeff Davis County","Jefferson County","Jenkins County","Johnson County","Jones County","Lamar County","Lanier County","Laurens County","Lee County","Liberty County","Lincoln County","Long County","Lowndes County","Lumpkin County","Macon County","Madison County","Marion County","McDuffie County","McIntosh County","Meriwether County","Miller County","Mitchell County","Monroe County","Montgomery County","Morgan County","Murray County","Muscogee County","Newton County","Oconee County","Oglethorpe County","Paulding County","Peach County","Pickens County","Pierce County","Pike County","Polk County","Pulaski County","Putnam County","Quitman County","Rabun County","Randolph County","Richmond County","Rockdale County","Schley County","Screven County","Seminole County","Spalding County","Stephens County","Stewart County","Sumter County","Talbot County","Taliaferro County","Tattnall County","Taylor County","Telfair County","Terrell County","Thomas County","Tift County","Toombs County","Towns County","Treutlen County","Troup County","Turner County","Twiggs County","Union County","Upson County","Walker County","Walton County","Ware County","Warren County","Washington County","Wayne County","Webster County","Wheeler County","White County","Whitfield County","Wilcox County","Wilkes County","Wilkinson County","Worth County"]
[null,null,null,null,null,null,"non-irrigated lands",null,null,null,null,null,null,"Alabama","Cherokee County",2,null,"Idaho",{"$f":"TRANSPOSE(_xlfn._xlws.FILTER(tLists4[County],tLists4[State]=R11))","v":"Ada County"},"Adams County","Bannock County","Bear Lake County","Benewah County","Bingham County","Blaine County","Boise County","Bonner County","Bonneville County","Boundary County","Butte County","Camas County","Canyon County","Caribou County","Cassia County","Clark County","Clearwater County","Custer County","Elmore County","Franklin County","Fremont County","Gem County","Gooding County","Idaho County","Jefferson County","Jerome County","Kootenai County","Latah County","Lemhi County","Lewis County","Lincoln County","Madison County","Minidoka County","Nez Perce County","Oneida County","Owyhee County","Payette County","Power County","Shoshone County","Teton County","Twin Falls County","Valley County","Washington County"]
[null,null,null,null,null,null,"soil moisture sensors/evapotranspiration meters with center pivots & sprinklers",null,null,null,null,null,null,"Alabama","Chilton County",2,null,"Illinois",{"$f":"TRANSPOSE(_xlfn._xlws.FILTER(tLists4[County],tLists4[State]=R12))","v":"Adams County"},"Alexander County","Bond County","Boone County","Brown County","Bureau County","Calhoun County","Carroll County","Cass County","Champaign County","Christian County","Clark County","Clay County","Clinton County","Coles County","Cook County","Crawford County","Cumberland County","De Witt County","DeKalb County","Douglas County","DuPage County","Edgar County","Edwards County","Effingham County","Fayette County","Ford County","Franklin County","Fulton County","Gallatin County","Greene County","Grundy County","Hamilton County","Hancock County","Hardin County","Henderson County","Henry County","Iroquois County","Jackson County","Jasper County","Jefferson County","Jersey County","Jo Daviess County","Johnson County","Kane County","Kankakee County","Kendall County","Knox County","Lake County","LaSalle County","Lawrence County","Lee County","Livingston County","Logan County","Macon County","Macoupin County","Madison County","Marion County","Marshall County","Mason County","Massac County","McDonough County","McHenry County","McLean County","Menard County","Mercer County","Monroe County","Montgomery County","Morgan County","Moultrie County","Ogle County","Peoria County","Perry County","Piatt County","Pike County","Pope County","Pulaski County","Putnam County","Randolph County","Richland County","Rock Island County","Saline County","Sangamon County","Schuyler County","Scott County","Shelby County","St. Clair County","Stark County","Stephenson County","Tazewell County","Union County","Vermilion County","Wabash County","Warren County","Washington County","Wayne County","White County","Whiteside County","Will County","Williamson County","Winnebago County","Woodford County"]
[null,null,null,null,null,null,null,null,null,null,null,null,null,"Alabama","Choctaw County","Not Eligible for Credit",null,"Indiana",{"$f":"TRANSPOSE(_xlfn._xlws.FILTER(tLists4[County],tLists4[State]=R13))","v":"Adams County"},"Allen County","Bartholomew County","Benton County","Blackford County","Boone County","Brown County","Carroll County","Cass County","Clark County","Clay County","Clinton County","Crawford County","Daviess County","Dearborn County","Decatur County","DeKalb County","Delaware County","Dubois County","Elkhart County","Fayette County","Floyd County","Fountain County","Franklin County","Fulton County","Gibson County","Grant County","Greene County","Hamilton County","Hancock County","Harrison County","Hendricks County","Henry County","Howard County","Huntington County","Jackson County","Jasper County","Jay County","Jefferson County","Jennings County","Johnson County","Knox County","Kosciusko County","LaGrange County","Lake County","LaPorte County","Lawrence County","Madison County","Marion County","Marshall County","Martin County","Miami County","Monroe County","Montgomery County","Morgan County","Newton County","Noble County","Ohio County","Orange County","Owen County","Parke County","Perry County","Pike County","Porter County","Posey County","Pulaski County","Putnam County","Randolph County","Ripley County","Rush County","Scott County","Shelby County","Spencer County","St. Joseph County","Starke County","Steuben County","Sullivan County","Switzerland County","Tippecanoe County","Tipton County","Union County","Vanderburgh County","Vermillion County","Vigo County","Wabash County","Warren County","Warrick County","Washington County","Wayne County","Wells County","White County","Whitley County"]
[null,null,null,null,null,null,null,null,null,null,null,null,null,"Alabama","Clarke County",2,null,"Iowa",{"$f":"TRANSPOSE(_xlfn._xlws.FILTER(tLists4[County],tLists4[State]=R14))","v":"Adair County"},"Adams County","Allamakee County","Appanoose County","Audubon County","Benton County","Black Hawk County","Boone County","Bremer County","Buchanan County","Buena Vista County","Butler County","Calhoun County","Carroll County","Cass County","Cedar County","Cerro Gordo County","Cherokee County","Chickasaw County","Clarke County","Clay County","Clayton County","Clinton County","Crawford County","Dallas County","Davis County","Decatur County","Delaware County","Des Moines County","Dickinson County","Dubuque County","Emmet County","Fayette County","Floyd County","Franklin County","Fremont County","Greene County","Grundy County","Guthrie County","Hamilton County","Hancock County","Hardin County","Harrison County","Henry County","Howard County","Humboldt County","Ida County","Iowa County","Jackson County","Jasper County","Jefferson County","Johnson County","Jones County","Keokuk County","Kossuth County","Lee County","Linn County","Louisa County","Lucas County","Lyon County","Madison County","Mahaska County","Marion County","Marshall County","Mills County","Mitchell County","Monona County","Monroe County","Montgomery County","Muscatine County","O'Brien County","Osceola County","Page County","Palo Alto County","Plymouth County","Pocahontas County","Polk County","Pottawattamie County","Poweshiek County","Ringgold County","Sac County","Scott County","Shelby County","Sioux County","Story County","Tama County","Taylor County","Union County","Van Buren County","Wapello County","Warren County","Washington County","Wayne County","Webster County","Winnebago County","Winneshiek County","Woodbury County","Worth County","Wright County"]
[null,null,null,null,null,null,null,null,null,null,null,null,null,"Alabama","Clay County",2,null,"Kansas",{"$f":"TRANSPOSE(_xlfn._xlws.FILTER(tLists4[County],tLists4[State]=R15))","v":"Allen County"},"Anderson County","Atchison County","Barber County","Barton County","Bourbon County","Brown County","Butler County","Chase County","Chautauqua County","Cherokee County","Cheyenne County","Clark County","Clay County","Cloud County","Coffey County","Comanche County","Cowley County","Crawford County","Decatur County","Dickinson County","Doniphan County","Douglas County","Edwards County","Elk County","Ellis County","Ellsworth County","Finney County","Ford County","Franklin County","Geary County","Gove County","Graham County","Grant County","Gray County","Greeley County","Greenwood County","Hamilton County","Harper County","Harvey County","Haskell County","Hodgeman County","Jackson County","Jefferson County","Jewell County","Johnson County","Kearny County","Kingman County","Kiowa County","Labette County","Lane County","Leavenworth County","Lincoln County","Linn County","Logan County","Lyon County","Marion County","Marshall County","McPherson County","Meade County","Miami County","Mitchell County","Montgomery County","Morris County","Morton County","Nemaha County","Neosho County","Ness County","Norton County","Osage County","Osborne County","Ottawa County","Pawnee County","Phillips County","Pottawatomie County","Pratt County","Rawlins County","Reno County","Republic County","Rice County","Riley County","Rooks County","Rush County","Russell County","Saline County","Scott County","Sedgwick County","Seward County","Shawnee County","Sheridan County","Sherman County","Smith County","Stafford County","Stanton County","Stevens County","Sumner County","Thomas County","Trego County","Wabaunsee County","Wallace County","Washington County","Wichita County","Wilson County","Woodson County","Wyandotte County"]
[null,null,null,null,null,null,null,null,null,null,null,null,null,"Alabama","Cleburne County","Not Eligible for Credit",null,"Kentucky",{"$f":"TRANSPOSE(_xlfn._xlws.FILTER(tLists4[County],tLists4[State]=R16))","v":"Adair County"},"Allen County","Anderson County","Ballard County","Barren County","Bath County","Bell County","Boone County","Bourbon County","Boyd County","Boyle County","Bracken County","Breathitt County","Breckinridge County","Bullitt County","Butler County","Caldwell County","Calloway County","Campbell County","Carlisle County","Carroll County","Carter County","Casey County","Christian County","Clark County","Clay County","Clinton County","Crittenden County","Cumberland County","Daviess County","Edmonson County","Elliott County","Estill County","Fayette County","Fleming County","Floyd County","Franklin County","Fulton County","Gallatin County","Garrard County","Grant County","Graves County","Grayson County","Green County","Greenup County","Hancock County","Hardin County","Harlan County","Harrison County","Hart County","Henderson County","Henry County","Hickman County","Hopkins County","Jackson County","Jefferson County","Jessamine County","Johnson County","Kenton County","Knott County","Knox County","Larue County","Laurel County","Lawrence County","Lee County","Leslie County","Letcher County","Lewis County","Lincoln County","Livingston County","Logan County","Lyon County","Madison County","Magoffin County","Marion County","Marshall County","Martin County","Mason County","McCracken County","McCreary County","McLean County","Meade County","Menifee County","Mercer County","Metcalfe County","Monroe County","Montgomery County","Morgan County","Muhlenberg County","Nelson County","Nicholas County","Ohio County","Oldham County","Owen County","Owsley County","Pendleton County","Perry County","Pike County","Powell County","Pulaski County","Robertson County","Rockcastle County","Rowan County","Russell County","Scott County","Shelby County","Simpson County","Spencer County","Taylor County","Todd County","Trigg County","Trimble County","Union County","Warren County","Washington County","Wayne County","Webster County","Whitley County","Wolfe County","Woodford County"]
[null,null,null,null,null,null,null,null,null,null,null,null,null,"Alabama","Coffee County",2,null,"Louisiana",{"$f":"TRANSPOSE(_xlfn._xlws.FILTER(tLists4[County],tLists4[State]=R17))","v":"Acadia Parish"},"Allen Parish","Ascension Parish","Assumption Parish","Avoyelles Parish","Beauregard Parish","Bienville Parish","Bossier Parish","Caddo Parish","Calcasieu Parish","Caldwell Parish","Cameron Parish","Catahoula Parish","Claiborne Parish","Concordia Parish","De Soto Parish","East Baton Rouge Parish","East Carroll Parish","East Feliciana Parish","Evangeline Parish","Franklin Parish","Grant Parish","Iberia Parish","Iberville Parish","Jackson Parish","Jefferson Davis Parish","Jefferson Parish","Lafayette Parish","Lafourche Parish","LaSalle Parish","Lincoln Parish","Livingston Parish","Madison Parish","Morehouse Parish","Natchitoches Parish","Orleans Parish","Ouachita Parish","Plaquemines Parish","Pointe Coupee Parish","Rapides Parish","Red River Parish","Richland Parish","Sabine Parish","St. Bernard Parish","St. Charles Parish","St. Helena Parish","St. James Parish","St. John the Baptist Parish","St. Landry Parish","St. Martin Parish","St. Mary Parish","St. Tammany Parish","Tangipahoa Parish","Tensas Parish","Terrebonne Parish","Union Parish","Vermilion Parish","Vernon Parish","Washington Parish","Webster Parish","West Baton Rouge Parish","West Carroll Parish","West Feliciana Parish","Winn Parish"]
[null,null,null,null,null,null,null,null,null,null,null,null,null,"Alabama","Colbert County",2,null,"Maine",{"$f":"TRANSPOSE(_xlfn._xlws.FILTER(tLists4[County],tLists4[State]=R18))","v":"Androscoggin County"},"Aroostook County","Cumberland County","Franklin County","Hancock County","Kennebec County","Knox County","Lincoln County","Oxford County","Penobscot County","Piscataquis County","Sagadahoc County","Somerset County","Waldo County","Washington County","York County"]
[null,null,null,null,null,null,null,null,null,null,null,null,null,"Alabama","Conecuh County","Not Eligible for Credit",null,"Maryland",{"$f":"TRANSPOSE(_xlfn._xlws.FILTER(tLists4[County],tLists4[State]=R19))","v":"Allegany County"},"Anne Arundel County","Baltimore City","Baltimore County","Calvert County","Caroline County","Carroll County","Cecil County","Charles County","Dorchester County","Frederick County","Garrett County","Harford County","Howard County","Kent County","Montgomery County","Prince George's County","Queen Anne's County","Somerset County","St. Mary's County","Talbot County","Washington County","Wicomico County","Worcester County"]
[null,null,null,null,null,null,null,null,null,null,null,null,null,"Alabama","Coosa County",2,null,"Massachusetts",{"$f":"TRANSPOSE(_xlfn._xlws.FILTER(tLists4[County],tLists4[State]=R20))","v":"Barnstable County"},"Berkshire County","Bristol County","Dukes County","Essex County","Franklin County","Hampden County","Hampshire County","Middlesex County","Nantucket County","Norfolk County","Plymouth County","Suffolk County","Worcester County"]
[null,null,null,null,null,null,null,null,null,null,null,null,null,"Alabama","Covington County",2,null,"Michigan",{"$f":"TRANSPOSE(_xlfn._xlws.FILTER(tLists4[County],tLists4[State]=R21))","v":"Alcona County"},"Alger County","Allegan County","Alpena County","Antrim County","Arenac County","Baraga County","Barry County","Bay County","Benzie County","Berrien County","Branch County","Calhoun County","Cass County","Charlevoix County","Cheboygan County","Chippewa County","Clare County","Clinton County","Crawford County","Delta County","Dickinson County","Eaton County","Emmet County","Genesee County","Gladwin County","Gogebic County","Grand Traverse County","Gratiot County","Hillsdale County","Houghton County","Huron County","Ingham County","Ionia County","Iosco County","Iron County","Isabella County","Jackson County","Kalamazoo County","Kalkaska County","Kent County","Keweenaw County","Lake County","Lapeer County","Leelanau County","Lenawee County","Livingston County","Luce County","Mackinac County","Macomb County","Manistee County","Marquette County","Mason County","Mecosta County","Menominee County","Midland County","Missaukee County","Monroe County","Montcalm County","Montmorency County","Muskegon County","Newaygo County","Oakland County","Oceana County","Ogemaw County","Ontonagon County","Osceola County","Oscoda County","Otsego County","Ottawa County","Presque Isle County","Roscommon County","Saginaw County","Sanilac County","Schoolcraft County","Shiawassee County","St. Clair County","St. Joseph County","Tuscola County","Van Buren County","Washtenaw County","Wayne County","Wexford County"]
[null,null,null,null,null,null,null,null,null,null,null,null,null,"Alabama","Crenshaw County",2,null,"Minnesota",{"$f":"TRANSPOSE(_xlfn._xlws.FILTER(tLists4[County],tLists4[State]=R22))","v":"Aitkin County"},"Anoka County","Becker County","Beltrami County","Benton County","Big Stone County","Blue Earth County","Brown County","Carlton County","Carver County","Cass County","Chippewa County","Chisago County","Clay County","Clearwater County","Cook County","Cottonwood County","Crow Wing County","Dakota County","Dodge County","Douglas County","Faribault County","Fillmore County","Freeborn County","Goodhue County","Grant County","Hennepin County","Houston County","Hubbard County","Isanti County","Itasca County","Jackson County","Kanabec County","Kandiyohi County","Kittson County","Koochiching County","Lac qui Parle County","Lake County","Lake of the Woods County","Le Sueur County","Lincoln County","Lyon County","Mahnomen County","Marshall County","Martin County","McLeod County","Meeker County","Mille Lacs County","Morrison County","Mower County","Murray County","Nicollet County","Nobles County","Norman County","Olmsted County","Otter Tail County","Pennington County","Pine County","Pipestone County","Polk County","Pope County","Ramsey County","Red Lake County","Redwood County","Renville County","Rice County","Rock County","Roseau County","Scott County","Sherburne County","Sibley County","St. Louis County","Stearns County","Steele County","Stevens County","Swift County","Todd County","Traverse County","Wabasha County","Wadena County","Waseca County","Washington County","Watonwan County","Wilkin County","Winona County","Wright County","Yellow Medicine County"]
[null,null,null,null,null,null,null,null,null,null,null,null,null,"Alabama","Cullman County",2,null,"Mississippi",{"$f":"TRANSPOSE(_xlfn._xlws.FILTER(tLists4[County],tLists4[State]=R23))","v":"Adams County"},"Alcorn County","Amite County","Attala County","Benton County","Bolivar County","Calhoun County","Carroll County","Chickasaw County","Choctaw County","Claiborne County","Clarke County","Clay County","Coahoma County","Copiah County","Covington County","DeSoto County","Forrest County","Franklin County","George County","Greene County","Grenada County","Hancock County","Harrison County","Hinds County","Holmes County","Humphreys County","Issaquena County","Itawamba County","Jackson County","Jasper County","Jefferson County","Jefferson Davis County","Jones County","Kemper County","Lafayette County","Lamar County","Lauderdale County","Lawrence County","Leake County","Lee County","Leflore County","Lincoln County","Lowndes County","Madison County","Marion County","Marshall County","Monroe County","Montgomery County","Neshoba County","Newton County","Noxubee County","Oktibbeha County","Panola County","Pearl River County","Perry County","Pike County","Pontotoc County","Prentiss County","Quitman County","Rankin County","Scott County","Sharkey County","Simpson County","Smith County","Stone County","Sunflower County","Tallahatchie County","Tate County","Tippah County","Tishomingo County","Tunica County","Union County","Walthall County","Warren County","Washington County","Wayne County","Webster County","Wilkinson County","Winston County","Yalobusha County","Yazoo County"]
[null,null,null,null,null,null,null,null,null,null,null,null,null,"Alabama","Dale County",2,null,"Missouri",{"$f":"TRANSPOSE(_xlfn._xlws.FILTER(tLists4[County],tLists4[State]=R24))","v":"Adair County"},"Andrew County","Atchison County","Audrain County","Barry County","Barton County","Bates County","Benton County","Bollinger County","Boone County","Buchanan County","Butler County","Caldwell County","Callaway County","Camden County","Cape Girardeau County","Carroll County","Carter County","Cass County","Cedar County","Chariton County","Christian County","Clark County","Clay County","Clinton County","Cole County","Cooper County","Crawford County","Dade County","Dallas County","Daviess County","DeKalb County","Dent County","Douglas County","Dunklin County","Franklin County","Gasconade County","Gentry County","Greene County","Grundy County","Harrison County","Henry County","Hickory County","Holt County","Howard County","Howell County","Iron County","Jackson County","Jasper County","Jefferson County","Johnson County","Knox County","Laclede County","Lafayette County","Lawrence County","Lewis County","Lincoln County","Linn County","Livingston County","Macon County","Madison County","Maries County","Marion County","McDonald County","Mercer County","Miller County","Mississippi County","Moniteau County","Monroe County","Montgomery County","Morgan County","New Madrid County","Newton County","Nodaway County","Oregon County","Osage County","Ozark County","Pemiscot County","Perry County","Pettis County","Phelps County","Pike County","Platte County","Polk County","Pulaski County","Putnam County","Ralls County","Randolph County","Ray County","Reynolds County","Ripley County","Saline County","Schuyler County","Scotland County","Scott County","Shannon County","Shelby County","St. Charles County","St. Clair County","St. Francois County","St. Louis City","St. Louis County","Ste. Genevieve County","Stoddard County","Stone County","Sullivan County","Taney County","Texas County","Vernon County","Warren County","Washington County","Wayne County","Webster County","Worth County","Wright County"]
[null,null,null,null,null,null,null,null,null,null,null,null,null,"Alabama","Dallas County","Not Eligible for Credit",null,"Montana",{"$f":"TRANSPOSE(_xlfn._xlws.FILTER(tLists4[County],tLists4[State]=R25))","v":"Beaverhead County"},"Big Horn County","Blaine County","Broadwater County","Carbon County","Carter County","Cascade County","Chouteau County","Custer County","Daniels County","Dawson County","Deer Lodge County","Fallon County","Fergus County","Flathead County","Gallatin County","Garfield County","Glacier County","Golden Valley County","Granite County","Hill County","Jefferson County","Judith Basin County","Lake County","Lewis and Clark County","Liberty County","Lincoln County","Madison County","McCone County","Meagher County","Mineral County","Missoula County","Musselshell County","Park County","Petroleum County","Phillips County","Pondera County","Powder River County","Powell County","Prairie County","Ravalli County","Richland County","Roosevelt County","Rosebud County","Sanders County","Sheridan County","Silver Bow County","Stillwater County","Sweet Grass County","Teton County","Toole County","Treasure County","Valley County","Wheatland County","Wibaux County","Yellowstone County"]
[null,null,null,null,null,null,null,null,null,null,null,null,null,"Alabama","DeKalb County","Not Eligible for Credit",null,"Nebraska",{"$f":"TRANSPOSE(_xlfn._xlws.FILTER(tLists4[County],tLists4[State]=R26))","v":"Adams County"},"Antelope County","Arthur County","Banner County","Blaine County","Boone County","Box Butte County","Boyd County","Brown County","Buffalo County","Burt County","Butler County","Cass County","Cedar County","Chase County","Cherry County","Cheyenne County","Clay County","Colfax County","Cuming County","Custer County","Dakota County","Dawes County","Dawson County","Deuel County","Dixon County","Dodge County","Douglas County","Dundy County","Fillmore County","Franklin County","Frontier County","Furnas County","Gage County","Garden County","Garfield County","Gosper County","Grant County","Greeley County","Hall County","Hamilton County","Harlan County","Hayes County","Hitchcock County","Holt County","Hooker County","Howard County","Jefferson County","Johnson County","Kearney County","Keith County","Keya Paha County","Kimball County","Knox County","Lancaster County","Lincoln County","Logan County","Loup County","Madison County","McPherson County","Merrick County","Morrill County","Nance County","Nemaha County","Nuckolls County","Otoe County","Pawnee County","Perkins County","Phelps County","Pierce County","Platte County","Polk County","Red Willow County","Richardson County","Rock County","Saline County","Sarpy County","Saunders County","Scotts Bluff County","Seward County","Sheridan County","Sherman County","Sioux County","Stanton County","Thayer County","Thomas County","Thurston County","Valley County","Washington County","Wayne County","Webster County","Wheeler County","York County"]
[null,null,null,null,null,null,null,null,null,null,null,null,null,"Alabama","Elmore County",2,null,"Nevada",{"$f":"TRANSPOSE(_xlfn._xlws.FILTER(tLists4[County],tLists4[State]=R27))","v":"Carson City"},"Churchill County","Clark County","Douglas County","Elko County","Esmeralda County","Eureka County","Humboldt County","Lander County","Lincoln County","Lyon County","Mineral County","Nye County","Pershing County","Storey County","Washoe County","White Pine County"]
[null,null,null,null,null,null,null,null,null,null,null,null,null,"Alabama","Escambia County","Not Eligible for Credit",null,"New Hampshire",{"$f":"TRANSPOSE(_xlfn._xlws.FILTER(tLists4[County],tLists4[State]=R28))","v":"Belknap County"},"Carroll County","Cheshire County","Coos County","Grafton County","Hillsborough County","Merrimack County","Rockingham County","Strafford County","Sullivan County"]
[null,null,null,null,null,null,null,null,null,null,null,null,null,"Alabama","Etowah County",2,null,"New Jersey",{"$f":"TRANSPOSE(_xlfn._xlws.FILTER(tLists4[County],tLists4[State]=R29))","v":"Atlantic County"},"Bergen County","Burlington County","Camden County","Cape May County","Cumberland County","Essex County","Gloucester County","Hudson County","Hunterdon County","Mercer County","Middlesex County","Monmouth County","Morris County","Ocean County","Passaic County","Salem County","Somerset County","Sussex County","Union County","Warren County"]
[null,null,null,null,null,null,null,null,null,null,null,null,null,"Alabama","Fayette County",2,null,"New Mexico",{"$f":"TRANSPOSE(_xlfn._xlws.FILTER(tLists4[County],tLists4[State]=R30))","v":"Bernalillo County"},"Catron County","Chaves County","Cibola County","Colfax County","Curry County","De Baca County","Doña Ana County","Eddy County","Grant County","Guadalupe County","Harding County","Hidalgo County","Lea County","Lincoln County","Los Alamos County","Luna County","McKinley County","Mora County","Otero County","Quay County","Rio Arriba County","Roosevelt County","San Juan County","San Miguel County","Sandoval County","Santa Fe County","Sierra County","Socorro County","Taos County","Torrance County","Union County","Valencia County"]
[null,null,null,null,null,null,null,null,null,null,null,null,null,"Alabama","Franklin County",2,null,"New York",{"$f":"TRANSPOSE(_xlfn._xlws.FILTER(tLists4[County],tLists4[State]=R31))","v":"Albany County"},"Allegany County","Bronx County","Broome County","Cattaraugus County","Cayuga County","Chautauqua County","Chemung County","Chenango County","Clinton County","Columbia County","Cortland County","Delaware County","Dutchess County","Erie County","Essex County","Franklin County","Fulton County","Genesee County","Greene County","Hamilton County","Herkimer County","Jefferson County","Kings County","Lewis County","Livingston County","Madison County","Monroe County","Montgomery County","Nassau County","New York County","Niagara County","Oneida County","Onondaga County","Ontario County","Orange County","Orleans County","Oswego County","Otsego County","Putnam County","Queens County","Rensselaer County","Richmond County","Rockland County","Saratoga County","Schenectady County","Schoharie County","Schuyler County","Seneca County","St. Lawrence County","Steuben County","Suffolk County","Sullivan County","Tioga County","Tompkins County","Ulster County","Warren County","Washington County","Wayne County","Westchester County","Wyoming County","Yates County"]
[null,null,null,null,null,null,null,null,null,null,null,null,null,"Alabama","Geneva County","Not Eligible for Credit",null,"North Carolina",{"$f":"TRANSPOSE(_xlfn._xlws.FILTER(tLists4[County],tLists4[State]=R32))","v":"Alamance County"},"Alexander County","Alleghany County","Anson County","Ashe County","Avery County","Beaufort County","Bertie County","Bladen County","Brunswick County","Buncombe County","Burke County","Cabarrus County","Caldwell County","Camden County","Carteret County","Caswell County","Catawba County","Chatham County","Cherokee County","Chowan County","Clay County","Cleveland County","Columbus County","Craven County","Cumberland County","Currituck County","Dare County","Davidson County","Davie County","Duplin County","Durham County","Edgecombe County","Forsyth County","Franklin County","Gaston County","Gates County","Graham County","Granville County","Greene County","Guilford County","Halifax County","Harnett County","Haywood County","Henderson County","Hertford County","Hoke County","Hyde County","Iredell County","Jackson County","Johnston County","Jones County","Lee County","Lenoir County","Lincoln County","Macon County","Madison County","Martin County","McDowell County","Mecklenburg County","Mitchell County","Montgomery County","Moore County","Nash County","New Hanover County","Northampton County","Onslow County","Orange County","Pamlico County","Pasquotank County","Pender County","Perquimans County","Person County","Pitt County","Polk County","Randolph County","Richmond County","Robeson County","Rockingham County","Rowan County","Rutherford County","Sampson County","Scotland County","Stanly County","Stokes County","Surry County","Swain County","Transylvania County","Tyrrell County","Union County","Vance County","Wake County","Warren County","Washington County","Watauga County","Wayne County","Wilkes County","Wilson County","Yadkin County","Yancey County"]
[null,null,null,null,null,null,null,null,null,null,null,null,null,"Alabama","Greene County",2,null,"North Dakota",{"$f":"TRANSPOSE(_xlfn._xlws.FILTER(tLists4[County],tLists4[State]=R33))","v":"Adams County"},"Barnes County","Benson County","Billings County","Bottineau County","Bowman County","Burke County","Burleigh County","Cass County","Cavalier County","Dickey County","Divide County","Dunn County","Eddy County","Emmons County","Foster County","Golden Valley County","Grand Forks County","Grant County","Griggs County","Hettinger County","Kidder County","LaMoure County","Logan County","McHenry County","McIntosh County","McKenzie County","McLean County","Mercer County","Morton County","Mountrail County","Nelson County","Oliver County","Pembina County","Pierce County","Ramsey County","Ransom County","Renville County","Richland County","Rolette County","Sargent County","Sheridan County","Sioux County","Slope County","Stark County","Steele County","Stutsman County","Towner County","Traill County","Walsh County","Ward County","Wells County","Williams County"]
[null,null,null,null,null,null,null,null,null,null,null,null,null,"Alabama","Hale County",2,null,"Ohio",{"$f":"TRANSPOSE(_xlfn._xlws.FILTER(tLists4[County],tLists4[State]=R34))","v":"Adams County"},"Allen County","Ashland County","Ashtabula County","Athens County","Auglaize County","Belmont County","Brown County","Butler County","Carroll County","Champaign County","Clark County","Clermont County","Clinton County","Columbiana County","Coshocton County","Crawford County","Cuyahoga County","Darke County","Defiance County","Delaware County","Erie County","Fairfield County","Fayette County","Franklin County","Fulton County","Gallia County","Geauga County","Greene County","Guernsey County","Hamilton County","Hancock County","Hardin County","Harrison County","Henry County","Highland County","Hocking County","Holmes County","Huron County","Jackson County","Jefferson County","Knox County","Lake County","Lawrence County","Licking County","Logan County","Lorain County","Lucas County","Madison County","Mahoning County","Marion County","Medina County","Meigs County","Mercer County","Miami County","Monroe County","Montgomery County","Morgan County","Morrow County","Muskingum County","Noble County","Ottawa County","Paulding County","Perry County","Pickaway County","Pike County","Portage County","Preble County","Putnam County","Richland County","Ross County","Sandusky County","Scioto County","Seneca County","Shelby County","Stark County","Summit County","Trumbull County","Tuscarawas County","Union County","Van Wert County","Vinton County","Warren County","Washington County","Wayne County","Williams County","Wood County","Wyandot County"]
[null,null,null,null,null,null,null,null,null,null,null,null,null,"Alabama","Henry County",2,null,"Oklahoma",{"$f":"TRANSPOSE(_xlfn._xlws.FILTER(tLists4[County],tLists4[State]=R35))","v":"Adair County"},"Alfalfa County","Atoka County","Beaver County","Beckham County","Blaine County","Bryan County","Caddo County","Canadian County","Carter County","Cherokee County","Choctaw County","Cimarron County","Cleveland County","Coal County","Comanche County","Cotton County","Craig County","Creek County","Custer County","Delaware County","Dewey County","Ellis County","Garfield County","Garvin County","Grady County","Grant County","Greer County","Harmon County","Harper County","Haskell County","Hughes County","Jackson County","Jefferson County","Johnston County","Kay County","Kingfisher County","Kiowa County","Latimer County","Le Flore County","Lincoln County","Logan County","Love County","Major County","Marshall County","Mayes County","McClain County","McCurtain County","McIntosh County","Murray County","Muskogee County","Noble County","Nowata County","Okfuskee County","Oklahoma County","Okmulgee County","Osage County","Ottawa County","Pawnee County","Payne County","Pittsburg County","Pontotoc County","Pottawatomie County","Pushmataha County","Roger Mills County","Rogers County","Seminole County","Sequoyah County","Stephens County","Texas County","Tillman County","Tulsa County","Wagoner County","Washington County","Washita County","Woods County","Woodward County"]
[null,null,null,null,null,null,null,null,null,null,null,null,null,"Alabama","Houston County",2,null,"Oregon",{"$f":"TRANSPOSE(_xlfn._xlws.FILTER(tLists4[County],tLists4[State]=R36))","v":"Baker County"},"Benton County","Clackamas County","Clatsop County","Columbia County","Coos County","Crook County","Curry County","Deschutes County","Douglas County","Gilliam County","Grant County","Harney County","Hood River County","Jackson County","Jefferson County","Josephine County","Klamath County","Lake County","Lane County","Lincoln County","Linn County","Malheur County","Marion County","Morrow County","Multnomah County","Polk County","Sherman County","Tillamook County","Umatilla County","Union County","Wallowa County","Wasco County","Washington County","Wheeler County","Yamhill County"]
[null,null,null,null,null,null,null,null,null,null,null,null,null,"Alabama","Jackson County","Not Eligible for Credit",null,"Pennsylvania",{"$f":"TRANSPOSE(_xlfn._xlws.FILTER(tLists4[County],tLists4[State]=R37))","v":"Adams County"},"Allegheny County","Armstrong County","Beaver County","Bedford County","Berks County","Blair County","Bradford County","Bucks County","Butler County","Cambria County","Cameron County","Carbon County","Centre County","Chester County","Clarion County","Clearfield County","Clinton County","Columbia County","Crawford County","Cumberland County","Dauphin County","Delaware County","Elk County","Erie County","Fayette County","Forest County","Franklin County","Fulton County","Greene County","Huntingdon County","Indiana County","Jefferson County","Juniata County","Lackawanna County","Lancaster County","Lawrence County","Lebanon County","Lehigh County","Luzerne County","Lycoming County","McKean County","Mercer County","Mifflin County","Monroe County","Montgomery County","Montour County","Northampton County","Northumberland County","Perry County","Philadelphia County","Pike County","Potter County","Schuylkill County","Snyder County","Somerset County","Sullivan County","Susquehanna County","Tioga County","Union County","Venango County","Warren County","Washington County","Wayne County","Westmoreland County","Wyoming County","York County"]
[null,null,null,null,null,null,null,null,null,null,null,null,null,"Alabama","Jefferson County",2,null,"Rhode Island",{"$f":"TRANSPOSE(_xlfn._xlws.FILTER(tLists4[County],tLists4[State]=R38))","v":"Bristol County"},"Kent County","Newport County","Providence County","Washington County"]
[null,null,null,null,null,null,null,null,null,null,null,null,null,"Alabama","Lamar County",2,null,"South Carolina",{"$f":"TRANSPOSE(_xlfn._xlws.FILTER(tLists4[County],tLists4[State]=R39))","v":"Abbeville County"},"Aiken County","Allendale County","Anderson County","Bamberg County","Barnwell County","Beaufort County","Berkeley County","Calhoun County","Charleston County","Cherokee County","Chester County","Chesterfield County","Clarendon County","Colleton County","Darlington County","Dillon County","Dorchester County","Edgefield County","Fairfield County","Florence County","Georgetown County","Greenville County","Greenwood County","Hampton County","Horry County","Jasper County","Kershaw County","Lancaster County","Laurens County","Lee County","Lexington County","Marion County","Marlboro County","McCormick County","Newberry County","Oconee County","Orangeburg County","Pickens County","Richland County","Saluda County","Spartanburg County","Sumter County","Union County","Williamsburg County","York County"]
[null,null,null,null,null,null,null,null,null,null,null,null,null,"Alabama","Lauderdale County",2,null,"South Dakota",{"$f":"TRANSPOSE(_xlfn._xlws.FILTER(tLists4[County],tLists4[State]=R40))","v":"Aurora County"},"Beadle County","Bennett County","Bon Homme County","Brookings County","Brown County","Brule County","Buffalo County","Butte County","Campbell County","Charles Mix County","Clark County","Clay County","Codington County","Corson County","Custer County","Davison County","Day County","Deuel County","Dewey County","Douglas County","Edmunds County","Fall River County","Faulk County","Grant County","Gregory County","Haakon County","Hamlin County","Hand County","Hanson County","Harding County","Hughes County","Hutchinson County","Hyde County","Jackson County","Jerauld County","Jones County","Kingsbury County","Lake County","Lawrence County","Lincoln County","Lyman County","Marshall County","McCook County","McPherson County","Meade County","Mellette County","Miner County","Minnehaha County","Moody County","Oglala Lakota County","Pennington County","Perkins County","Potter County","Roberts County","Sanborn County","Spink County","Stanley County","Sully County","Todd County","Tripp County","Turner County","Union County","Walworth County","Yankton County","Ziebach County"]
[null,null,null,null,null,null,null,null,null,null,null,null,null,"Alabama","Lawrence County","Not Eligible for Credit",null,"Tennessee",{"$f":"TRANSPOSE(_xlfn._xlws.FILTER(tLists4[County],tLists4[State]=R41))","v":"Anderson County"},"Bedford County","Benton County","Bledsoe County","Blount County","Bradley County","Campbell County","Cannon County","Carroll County","Carter County","Cheatham County","Chester County","Claiborne County","Clay County","Cocke County","Coffee County","Crockett County","Cumberland County","Davidson County","Decatur County","DeKalb County","Dickson County","Dyer County","Fayette County","Fentress County","Franklin County","Gibson County","Giles County","Grainger County","Greene County","Grundy County","Hamblen County","Hamilton County","Hancock County","Hardeman County","Hardin County","Hawkins County","Haywood County","Henderson County","Henry County","Hickman County","Houston County","Humphreys County","Jackson County","Jefferson County","Johnson County","Knox County","Lake County","Lauderdale County","Lawrence County","Lewis County","Lincoln County","Loudon County","Macon County","Madison County","Marion County","Marshall County","Maury County","McMinn County","McNairy County","Meigs County","Monroe County","Montgomery County","Moore County","Morgan County","Obion County","Overton County","Perry County","Pickett County","Polk County","Putnam County","Rhea County","Roane County","Robertson County","Rutherford County","Scott County","Sequatchie County","Sevier County","Shelby County","Smith County","Stewart County","Sullivan County","Sumner County","Tipton County","Trousdale County","Unicoi County","Union County","Van Buren County","Warren County","Washington County","Wayne County","Weakley County","White County","Williamson County","Wilson County"]
[null,null,null,null,null,null,null,null,null,null,null,null,null,"Alabama","Lee County",2,null,"Texas",{"$f":"TRANSPOSE(_xlfn._xlws.FILTER(tLists4[County],tLists4[State]=R42))","v":"Anderson County"},"Andrews County","Angelina County","Aransas County","Archer County","Armstrong County","Atascosa County","Austin County","Bailey County","Bandera County","Bastrop County","Baylor County","Bee County","Bell County","Bexar County","Blanco County","Borden County","Bosque County","Bowie County","Brazoria County","Brazos County","Brewster County","Briscoe County","Brooks County","Brown County","Burleson County","Burnet County","Caldwell County","Calhoun County","Callahan County","Cameron County","Camp County","Carson County","Cass County","Castro County","Chambers County","Cherokee County","Childress County","Clay County","Cochran County","Coke County","Coleman County","Collin County","Collingsworth County","Colorado County","Comal County","Comanche County","Concho County","Cooke County","Coryell County","Cottle County","Crane County","Crockett County","Crosby County","Culberson County","Dallam County","Dallas County","Dawson County","Deaf Smith County","Delta County","Denton County","DeWitt County","Dickens County","Dimmit County","Donley County","Duval County","Eastland County","Ector County","Edwards County","El Paso County","Ellis County","Erath County","Falls County","Fannin County","Fayette County","Fisher County","Floyd County","Foard County","Fort Bend County","Franklin County","Freestone County","Frio County","Gaines County","Galveston County","Garza County","Gillespie County","Glasscock County","Goliad County","Gonzales County","Gray County","Grayson County","Gregg County","Grimes County","Guadalupe County","Hale County","Hall County","Hamilton County","Hansford County","Hardeman County","Hardin County","Harris County","Harrison County","Hartley County","Haskell County","Hays County","Hemphill County","Henderson County","Hidalgo County","Hill County","Hockley County","Hood County","Hopkins County","Houston County","Howard County","Hudspeth County","Hunt County","Hutchinson County","Irion County","Jack County","Jackson County","Jasper County","Jeff Davis County","Jefferson County","Jim Hogg County","Jim Wells County","Johnson County","Jones County","Karnes County","Kaufman County","Kendall County","Kenedy County","Kent County","Kerr County","Kimble County","King County","Kinney County","Kleberg County","Knox County","La Salle County","Lamar County","Lamb County","Lampasas County","Lavaca County","Lee County","Leon County","Liberty County","Limestone County","Lipscomb County","Live Oak County","Llano County","Loving County","Lubbock County","Lynn County","Madison County","Marion County","Martin County","Mason County","Matagorda County","Maverick County","McCulloch County","McLennan County","McMullen County","Medina County","Menard County","Midland County","Milam County","Mills County","Mitchell County","Montague County","Montgomery County","Moore County","Morris County","Motley County","Nacogdoches County","Navarro County","Newton County","Nolan County","Nueces County","Ochiltree County","Oldham County","Orange County","Palo Pinto County","Panola County","Parker County","Parmer County","Pecos County","Polk County","Potter County","Presidio County","Rains County","Randall County","Reagan County","Real County","Red River County","Reeves County","Refugio County","Roberts County","Robertson County","Rockwall County","Runnels County","Rusk County","Sabine County","San Augustine County","San Jacinto County","San Patricio County","San Saba County","Schleicher County","Scurry County","Shackelford County","Shelby County","Sherman County","Smith County","Somervell County","Starr County","Stephens County","Sterling County","Stonewall County","Sutton County","Swisher County","Tarrant County","Taylor County","Terrell County","Terry County","Throckmorton County","Titus County","Tom Green County","Travis County","Trinity County","Tyler County","Upshur County","Upton County","Uvalde County","Val Verde County","Van Zandt County","Victoria County","Walker County","Waller County","Ward County","Washington County","Webb County","Wharton County","Wheeler County","Wichita County","Wilbarger County","Willacy County","Williamson County","Wilson County","Winkler County","Wise County","Wood County","Yoakum County","Young County","Zapata County","Zavala County"]
[null,null,null,null,null,null,null,null,null,null,null,null,null,"Alabama","Limestone County","Not Eligible for Credit",null,"Utah",{"$f":"TRANSPOSE(_xlfn._xlws.FILTER(tLists4[County],tLists4[State]=R43))","v":"Beaver County"},"Box Elder County","Cache County","Carbon County","Daggett County","Davis County","Duchesne County","Emery County","Garfield County","Grand County","Iron County","Juab County","Kane County","Millard County","Morgan County","Piute County","Rich County","Salt Lake County","San Juan County","Sanpete County","Sevier County","Summit County","Tooele County","Uintah County","Utah County","Wasatch County","Washington County","Wayne County","Weber County"]
[null,null,null,null,null,null,null,null,null,null,null,null,null,"Alabama","Lowndes County","Not Eligible for Credit",null,"Vermont",{"$f":"TRANSPOSE(_xlfn._xlws.FILTER(tLists4[County],tLists4[State]=R44))","v":"Addison County"},"Bennington County","Caledonia County","Chittenden County","Essex County","Franklin County","Grand Isle County","Lamoille County","Orange County","Orleans County","Rutland County","Washington County","Windham County","Windsor County"]
[null,null,null,null,null,null,null,null,null,null,null,null,null,"Alabama","Macon County","Not Eligible for Credit",null,"Virginia",{"$f":"TRANSPOSE(_xlfn._xlws.FILTER(tLists4[County],tLists4[State]=R45))","v":"Accomack County"},"Albemarle County","Alexandria City","Alleghany County","Amelia County","Amherst County","Appomattox County","Arlington County","Augusta County","Bath County","Bedford County","Bland County","Botetourt County","Bristol City","Brunswick County","Buchanan County","Buckingham County","Buena Vista City","Campbell County","Caroline County","Carroll County","Charles City County","Charlotte County","Charlottesville City","Chesapeake City","Chesterfield County","Clarke County","Colonial Heights City","Covington City","Craig County","Culpeper County","Cumberland County","Danville City","Dickenson County","Dinwiddie County","Emporia City","Essex County","Fairfax City","Fairfax County","Falls Church City","Fauquier County","Floyd County","Fluvanna County","Franklin City","Franklin County","Frederick County","Fredericksburg City","Galax City","Giles County","Gloucester County","Goochland County","Grayson County","Greene County","Greensville County","Halifax County","Hampton City","Hanover County","Harrisonburg City","Henrico County","Henry County","Highland County","Hopewell City","Isle of Wight County","James City County","King and Queen County","King George County","King William County","Lancaster County","Lee County","Lexington City","Loudoun County","Louisa County","Lunenburg County","Lynchburg City","Madison County","Manassas City","Manassas Park City","Martinsville City","Mathews County","Mecklenburg County","Middlesex County","Montgomery County","Nelson County","New Kent County","Newport News City","Norfolk City","Northampton County","Northumberland County","Norton City","Nottoway County","Orange County","Page County","Patrick County","Petersburg City","Pittsylvania County","Poquoson City","Portsmouth City","Powhatan County","Prince Edward County","Prince George County","Prince William County","Pulaski County","Radford City","Rappahannock County","Richmond City","Richmond County","Roanoke City","Roanoke County","Rockbridge County","Rockingham County","Russell County","Salem City","Scott County","Shenandoah County","Smyth County","Southampton County","Spotsylvania County","Stafford County","Staunton City","Suffolk City","Surry County","Sussex County","Tazewell County","Virginia Beach City","Warren County","Washington County","Waynesboro City","Westmoreland County","Williamsburg City","Winchester City","Wise County","Wythe County","York County"]
[null,null,null,null,null,null,null,null,null,null,null,null,null,"Alabama","Madison County","Not Eligible for Credit",null,"Washington",{"$f":"TRANSPOSE(_xlfn._xlws.FILTER(tLists4[County],tLists4[State]=R46))","v":"Adams County"},"Asotin County","Benton County","Chelan County","Clallam County","Clark County","Columbia County","Cowlitz County","Douglas County","Ferry County","Franklin County","Garfield County","Grant County","Grays Harbor County","Island County","Jefferson County","King County","Kitsap County","Kittitas County","Klickitat County","Lewis County","Lincoln County","Mason County","Okanogan County","Pacific County","Pend Oreille County","Pierce County","San Juan County","Skagit County","Skamania County","Snohomish County","Spokane County","Stevens County","Thurston County","Wahkiakum County","Walla Walla County","Whatcom County","Whitman County","Yakima County"]
[null,null,null,null,null,null,null,null,null,null,null,null,null,"Alabama","Marengo County","Not Eligible for Credit",null,"West Virginia",{"$f":"TRANSPOSE(_xlfn._xlws.FILTER(tLists4[County],tLists4[State]=R47))","v":"Barbour County"},"Berkeley County","Boone County","Braxton County","Brooke County","Cabell County","Calhoun County","Clay County","Doddridge County","Fayette County","Gilmer County","Grant County","Greenbrier County","Hampshire County","Hancock County","Hardy County","Harrison County","Jackson County","Jefferson County","Kanawha County","Lewis County","Lincoln County","Logan County","Marion County","Marshall County","Mason County","McDowell County","Mercer County","Mineral County","Mingo County","Monongalia County","Monroe County","Morgan County","Nicholas County","Ohio County","Pendleton County","Pleasants County","Pocahontas County","Preston County","Putnam County","Raleigh County","Randolph County","Ritchie County","Roane County","Summers County","Taylor County","Tucker County","Tyler County","Upshur County","Wayne County","Webster County","Wetzel County","Wirt County","Wood County","Wyoming County"]
[null,null,null,null,null,null,null,null,null,null,null,null,null,"Alabama","Marion County",2,null,"Wisconsin",{"$f":"TRANSPOSE(_xlfn._xlws.FILTER(tLists4[County],tLists4[State]=R48))","v":"Adams County"},"Ashland County","Barron County","Bayfield County","Brown County","Buffalo County","Burnett County","Calumet County","Chippewa County","Clark County","Columbia County","Crawford County","Dane County","Dodge County","Door County","Douglas County","Dunn County","Eau Claire County","Florence County","Fond du Lac County","Forest County","Grant County","Green County","Green Lake County","Iowa County","Iron County","Jackson County","Jefferson County","Juneau County","Kenosha County","Kewaunee County","La Crosse County","Lafayette County","Langlade County","Lincoln County","Manitowoc County","Marathon County","Marinette County","Marquette County","Menominee County","Milwaukee County","Monroe County","Oconto County","Oneida County","Outagamie County","Ozaukee County","Pepin County","Pierce County","Polk County","Portage County","Price County","Racine County","Richland County","Rock County","Rusk County","Sauk County","Sawyer County","Shawano County","Sheboygan County","St. Croix County","Taylor County","Trempealeau County","Vernon County","Vilas County","Walworth County","Washburn County","Washington County","Waukesha County","Waupaca County","Waushara County","Winnebago County","Wood County"]
[null,null,null,null,null,null,null,null,null,null,null,null,null,"Alabama","Marshall County","Not Eligible for Credit",null,"Wyoming",{"$f":"TRANSPOSE(_xlfn._xlws.FILTER(tLists4[County],tLists4[State]=R49))","v":"Albany County"},"Big Horn County","Campbell County","Carbon County","Converse County","Crook County","Fremont County","Goshen County","Hot Springs County","Johnson County","Laramie County","Lincoln County","Natrona County","Niobrara County","Park County","Platte County","Sheridan County","Sublette County","Sweetwater County","Teton County","Uinta County","Washakie County","Weston County"]
[null,null,null,null,null,null,null,null,null,null,null,null,null,"Alabama","Mobile County","Not Eligible for Credit",null,null,{"$f":"TRANSPOSE(_xlfn._xlws.FILTER(tLists4[County],tLists4[State]=R50))","v":{"$error":"#VALUE!"}}]
[null,null,null,null,null,null,null,null,null,null,null,null,null,"Alabama","Monroe County","Not Eligible for Credit"]
[null,null,null,null,null,null,null,null,null,null,null,null,null,"Alabama","Montgomery County","Not Eligible for Credit"]
[null,null,null,null,null,null,null,null,null,null,null,null,null,"Alabama","Morgan County","Not Eligible for Credit"]
[null,null,null,null,null,null,null,null,null,null,null,null,null,"Alabama","Perry County","Not Eligible for Credit"]
[null,null,null,null,null,null,null,null,null,null,null,null,null,"Alabama","Pickens County","Not Eligible for Credit"]
[null,null,null,null,null,null,null,null,null,null,null,null,null,"Alabama","Pike County",2]
[null,null,null,null,null,null,null,null,null,null,null,null,null,"Alabama","Randolph County",2]
[null,null,null,null,null,null,null,null,null,null,null,null,null,"Alabama","Russell County",2]
[null,null,null,null,null,null,null,null,null,null,null,null,null,"Alabama","Shelby County",2]
[null,null,null,null,null,null,null,null,null,null,null,null,null,"Alabama","St. Clair County","Not Eligible for Credit"]
[null,null,null,null,null,null,null,null,null,null,null,null,null,"Alabama","Sumter County","Not Eligible for Credit"]
[null,null,null,null,null,null,null,null,null,null,null,null,null,"Alabama","Talladega County",2]
[null,null,null,null,null,null,null,null,null,null,null,null,null,"Alabama","Tallapoosa County",2]
[null,null,null,null,null,null,null,null,null,null,null,null,null,"Alabama","Tuscaloosa County",2]
[null,null,null,null,null,null,null,null,null,null,null,null,null,"Alabama","Walker County","Not Eligible for Credit"]
[null,null,null,null,null,null,null,null,null,null,null,null,null,"Alabama","Washington County","Not Eligible for Credit"]
[null,null,null,null,null,null,null,null,null,null,null,null,null,"Alabama","Wilcox County","Not Eligible for Credit"]
[null,null,null,null,null,null,null,null,null,null,null,null,null,"Alabama","Winston County",2]
[null,null,null,null,null,null,null,null,null,null,null,null,null,"Arizona","Apache County",6]
[null,null,null,null,null,null,null,null,null,null,null,null,null,"Arizona","Cochise County",3]
[null,null,null,null,null,null,null,null,null,null,null,null,null,"Arizona","Coconino County",6]
[null,null,null,null,null,null,null,null,null,null,null,null,null,"Arizona","Gila County",6]
[null,null,null,null,null,null,null,null,null,null,null,null,null,"Arizona","Graham County",6]
[null,null,null,null,null,null,null,null,null,null,null,null,null,"Arizona","Greenlee County",3]
[null,null,null,null,null,null,null,null,null,null,null,null,null,"Arizona","La Paz County",6]
[null,null,null,null,null,null,null,null,null,null,null,null,null,"Arizona","Maricopa County",3]
[null,null,null,null,null,null,null,null,null,null,null,null,null,"Arizona","Mohave County",6]
[null,null,null,null,null,null,null,null,null,null,null,null,null,"Arizona","Navajo County",6]
[null,null,null,null,null,null,null,null,null,null,null,null,null,"Arizona","Pima County",6]
[null,null,null,null,null,null,null,null,null,null,null,null,null,"Arizona","Pinal County",3]
[null,null,null,null,null,null,null,null,null,null,null,null,null,"Arizona","Santa Cruz County",3]
[null,null,null,null,null,null,null,null,null,null,null,null,null,"Arizona","Yavapai County",3]
[null,null,null,null,null,null,null,null,null,null,null,null,null,"Arizona","Yuma County",6]
[null,null,null,null,null,null,null,null,null,null,null,null,null,"Arkansas","Arkansas County",2]
[null,null,null,null,null,null,null,null,null,null,null,null,null,"Arkansas","Ashley County",2]
[null,null,null,null,null,null,null,null,null,null,null,null,null,"Arkansas","Baxter County",2]
[null,null,null,null,null,null,null,null,null,null,null,null,null,"Arkansas","Benton County","Not Eligible for Credit"]
[null,null,null,null,null,null,null,null,null,null,null,null,null,"Arkansas","Boone County",2]
[null,null,null,null,null,null,null,null,null,null,null,null,null,"Arkansas","Bradley County",2]
[null,null,null,null,null,null,null,null,null,null,null,null,null,"Arkansas","Calhoun County","Not Eligible for Credit"]
[null,null,null,null,null,null,null,null,null,null,null,null,null,"Arkansas","Carroll County",2]
[null,null,null,null,null,null,null,null,null,null,null,null,null,"Arkansas","Chicot County",2]
[null,null,null,null,null,null,null,null,null,null,null,null,null,"Arkansas","Clark County","Not Eligible for Credit"]
[null,null,null,null,null,null,null,null,null,null,null,null,null,"Arkansas","Clay County","Not Eligible for Credit"]
[null,null,null,null,null,null,null,null,null,null,null,null,null,"Arkansas","Cleburne County",2]
[null,null,null,null,null,null,null,null,null,null,null,null,null,"Arkansas","Cleveland County",2]
[null,null,null,null,null,null,null,null,null,null,null,null,null,"Arkansas","Columbia County",2]
[null,null,null,null,null,null,null,null,null,null,null,null,null,"Arkansas","Conway County","Not Eligible for Credit"]
[null,null,null,null,null,null,null,null,null,null,null,null,null,"Arkansas","Craighead County","Not Eligible for Credit"]
[null,null,null,null,null,null,null,null,null,null,null,null,null,"Arkansas","Crawford County","Not Eligible for Credit"]
[null,null,null,null,null,null,null,null,null,null,null,null,null,"Arkansas","Crittenden County",2]
[null,null,null,null,null,null,null,null,null,null,null,null,null,"Arkansas","Cross County","Not Eligible for Credit"]
[null,null,null,null,null,null,null,null,null,null,null,null,null,"Arkansas","Dallas County",2]
[null,null,null,null,null,null,null,null,null,null,null,null,null,"Arkansas","Desha County","Not Eligible for Credit"]
[null,null,null,null,null,null,null,null,null,null,null,null,null,"Arkansas","Drew County",2]
[null,null,null,null,null,null,null,null,null,null,null,null,null,"Arkansas","Faulkner County",2]
[null,null,null,null,null,null,null,null,null,null,null,null,null,"Arkansas","Franklin County","Not Eligible for Credit"]
[null,null,null,null,null,null,null,null,null,null,null,null,null,"Arkansas","Fulton County",2]
[null,null,null,null,null,null,null,null,null,null,null,null,null,"Arkansas","Garland County","Not Eligible for Credit"]
[null,null,null,null,null,null,null,null,null,null,null,null,null,"Arkansas","Grant County",2]
[null,null,null,null,null,null,null,null,null,null,null,null,null,"Arkansas","Greene County","Not Eligible for Credit"]
[null,null,null,null,null,null,null,null,null,null,null,null,null,"Arkansas","Hempstead County","Not Eligible for Credit"]
[null,null,null,null,null,null,null,null,null,null,null,null,null,"Arkansas","Hot Spring County","Not Eligible for Credit"]
[null,null,null,null,null,null,null,null,null,null,null,null,null,"Arkansas","Howard County","Not Eligible for Credit"]
[null,null,null,null,null,null,null,null,null,null,null,null,null,"Arkansas","Independence County",2]
[null,null,null,null,null,null,null,null,null,null,null,null,null,"Arkansas","Izard County",2]
[null,null,null,null,null,null,null,null,null,null,null,null,null,"Arkansas","Jackson County","Not Eligible for Credit"]
[null,null,null,null,null,null,null,null,null,null,null,null,null,"Arkansas","Jefferson County",2]
[null,null,null,null,null,null,null,null,null,null,null,null,null,"Arkansas","Johnson County",2]
[null,null,null,null,null,null,null,null,null,null,null,null,null,"Arkansas","Lafayette County","Not Eligible for Credit"]
[null,null,null,null,null,null,null,null,null,null,null,null,null,"Arkansas","Lawrence County",2]
[null,null,null,null,null,null,null,null,null,null,null,null,null,"Arkansas","Lee County","Not Eligible for Credit"]
[null,null,null,null,null,null,null,null,null,null,null,null,null,"Arkansas","Lincoln County",2]
[null,null,null,null,null,null,null,null,null,null,null,null,null,"Arkansas","Little River County","Not Eligible for Credit"]
[null,null,null,null,null,null,null,null,null,null,null,null,null,"Arkansas","Logan County","Not Eligible for Credit"]
[null,null,null,null,null,null,null,null,null,null,null,null,null,"Arkansas","Lonoke County","Not Eligible for Credit"]
[null,null,null,null,null,null,null,null,null,null,null,null,null,"Arkansas","Madison County","Not Eligible for Credit"]
[null,null,null,null,null,null,null,null,null,null,null,null,null,"Arkansas","Marion County",2]
[null,null,null,null,null,null,null,null,null,null,null,null,null,"Arkansas","Miller County","Not Eligible for Credit"]
[null,null,null,null,null,null,null,null,null,null,null,null,null,"Arkansas","Mississippi County","Not Eligible for Credit"]
[null,null,null,null,null,null,null,null,null,null,null,null,null,"Arkansas","Monroe County","Not Eligible for Credit"]
[null,null,null,null,null,null,null,null,null,null,null,null,null,"Arkansas","Montgomery County","Not Eligible for Credit"]
[null,null,null,null,null,null,null,null,null,null,null,null,null,"Arkansas","Nevada County",2]
[null,null,null,null,null,null,null,null,null,null,null,null,null,"Arkansas","Newton County","Not Eligible for Credit"]
[null,null,null,null,null,null,null,null,null,null,null,null,null,"Arkansas","Ouachita County",2]
[null,null,null,null,null,null,null,null,null,null,null,null,null,"Arkansas","Perry County","Not Eligible for Credit"]
[null,null,null,null,null,null,null,null,null,null,null,null,null,"Arkansas","Phillips County","Not Eligible for Credit"]
[null,null,null,null,null,null,null,null,null,null,null,null,null,"Arkansas","Pike County","Not Eligible for Credit"]
[null,null,null,null,null,null,null,null,null,null,null,null,null,"Arkansas","Poinsett County",2]
[null,null,null,null,null,null,null,null,null,null,null,null,null,"Arkansas","Polk County","Not Eligible for Credit"]
[null,null,null,null,null,null,null,null,null,null,null,null,null,"Arkansas","Pope County","Not Eligible for Credit"]
[null,null,null,null,null,null,null,null,null,null,null,null,null,"Arkansas","Prairie County","Not Eligible for Credit"]
[null,null,null,null,null,null,null,null,null,null,null,null,null,"Arkansas","Pulaski County","Not Eligible for Credit"]
[null,null,null,null,null,null,null,null,null,null,null,null,null,"Arkansas","Randolph County",2]
[null,null,null,null,null,null,null,null,null,null,null,null,null,"Arkansas","Saline County",2]
[null,null,null,null,null,null,null,null,null,null,null,null,null,"Arkansas","Scott County","Not Eligible for Credit"]
[null,null,null,null,null,null,null,null,null,null,null,null,null,"Arkansas","Searcy County",2]
[null,null,null,null,null,null,null,null,null,null,null,null,null,"Arkansas","Sebastian County","Not Eligible for Credit"]
[null,null,null,null,null,null,null,null,null,null,null,null,null,"Arkansas","Sevier County","Not Eligible for Credit"]
[null,null,null,null,null,null,null,null,null,null,null,null,null,"Arkansas","Sharp County",2]
[null,null,null,null,null,null,null,null,null,null,null,null,null,"Arkansas","St. Francis County","Not Eligible for Credit"]
[null,null,null,null,null,null,null,null,null,null,null,null,null,"Arkansas","Stone County","Not Eligible for Credit"]
[null,null,null,null,null,null,null,null,null,null,null,null,null,"Arkansas","Union County",2]
[null,null,null,null,null,null,null,null,null,null,null,null,null,"Arkansas","Van Buren County",2]
[null,null,null,null,null,null,null,null,null,null,null,null,null,"Arkansas","Washington County","Not Eligible for Credit"]
[null,null,null,null,null,null,null,null,null,null,null,null,null,"Arkansas","White County","Not Eligible for Credit"]
[null,null,null,null,null,null,null,null,null,null,null,null,null,"Arkansas","Woodruff County","Not Eligible for Credit"]
[null,null,null,null,null,null,null,null,null,null,null,null,null,"Arkansas","Yell County","Not Eligible for Credit"]
[null,null,null,null,null,null,null,null,null,null,null,null,null,"California","Alameda County",3]
[null,null,null,null,null,null,null,null,null,null,null,null,null,"California","Alpine County",3]
[null,null,null,null,null,null,null,null,null,null,null,null,null,"California","Amador County",3]
[null,null,null,null,null,null,null,null,null,null,null,null,null,"California","Butte County",3]
[null,null,null,null,null,null,null,null,null,null,null,null,null,"California","Calaveras County",3]
[null,null,null,null,null,null,null,null,null,null,null,null,null,"California","Colusa County",3]
[null,null,null,null,null,null,null,null,null,null,null,null,null,"California","Contra Costa County",3]
[null,null,null,null,null,null,null,null,null,null,null,null,null,"California","Del Norte County",2]
[null,null,null,null,null,null,null,null,null,null,null,null,null,"California","El Dorado County",3]
[null,null,null,null,null,null,null,null,null,null,null,null,null,"California","Fresno County",3]
[null,null,null,null,null,null,null,null,null,null,null,null,null,"California","Glenn County",3]
[null,null,null,null,null,null,null,null,null,null,null,null,null,"California","Humboldt County",3]
[null,null,null,null,null,null,null,null,null,null,null,null,null,"California","Imperial County",6]
[null,null,null,null,null,null,null,null,null,null,null,null,null,"California","Inyo County",3]
[null,null,null,null,null,null,null,null,null,null,null,null,null,"California","Kern County",3]
[null,null,null,null,null,null,null,null,null,null,null,null,null,"California","Kings County",3]
[null,null,null,null,null,null,null,null,null,null,null,null,null,"California","Lake County",3]
[null,null,null,null,null,null,null,null,null,null,null,null,null,"California","Lassen County",3]
[null,null,null,null,null,null,null,null,null,null,null,null,null,"California","Los Angeles County",3]
[null,null,null,null,null,null,null,null,null,null,null,null,null,"California","Madera County",3]
[null,null,null,null,null,null,null,null,null,null,null,null,null,"California","Marin County",3]
[null,null,null,null,null,null,null,null,null,null,null,null,null,"California","Mariposa County",3]
[null,null,null,null,null,null,null,null,null,null,null,null,null,"California","Mendocino County",3]
[null,null,null,null,null,null,null,null,null,null,null,null,null,"California","Merced County",3]
[null,null,null,null,null,null,null,null,null,null,null,null,null,"California","Modoc County",3]
[null,null,null,null,null,null,null,null,null,null,null,null,null,"California","Mono County",6]
[null,null,null,null,null,null,null,null,null,null,null,null,null,"California","Monterey County",3]
[null,null,null,null,null,null,null,null,null,null,null,null,null,"California","Napa County",3]
[null,null,null,null,null,null,null,null,null,null,null,null,null,"California","Nevada County",3]
[null,null,null,null,null,null,null,null,null,null,null,null,null,"California","Orange County",3]
[null,null,null,null,null,null,null,null,null,null,null,null,null,"California","Placer County",3]
[null,null,null,null,null,null,null,null,null,null,null,null,null,"California","Plumas County",3]
[null,null,null,null,null,null,null,null,null,null,null,null,null,"California","Riverside County",6]
[null,null,null,null,null,null,null,null,null,null,null,null,null,"California","Sacramento County",3]
[null,null,null,null,null,null,null,null,null,null,null,null,null,"California","San Benito County",3]
[null,null,null,null,null,null,null,null,null,null,null,null,null,"California","San Bernardino County",6]
[null,null,null,null,null,null,null,null,null,null,null,null,null,"California","San Diego County",3]
[null,null,null,null,null,null,null,null,null,null,null,null,null,"California","San Francisco County",3]
[null,null,null,null,null,null,null,null,null,null,null,null,null,"California","San Joaquin County",3]
[null,null,null,null,null,null,null,null,null,null,null,null,null,"California","San Luis Obispo County",3]
[null,null,null,null,null,null,null,null,null,null,null,null,null,"California","San Mateo County",3]
[null,null,null,null,null,null,null,null,null,null,null,null,null,"California","Santa Barbara County",3]
[null,null,null,null,null,null,null,null,null,null,null,null,null,"California","Santa Clara County",3]
[null,null,null,null,null,null,null,null,null,null,null,null,null,"California","Santa Cruz County",2]
[null,null,null,null,null,null,null,null,null,null,null,null,null,"California","Shasta County",3]
[null,null,null,null,null,null,null,null,null,null,null,null,null,"California","Sierra County",3]
[null,null,null,null,null,null,null,null,null,null,null,null,null,"California","Siskiyou County",3]
[null,null,null,null,null,null,null,null,null,null,null,null,null,"California","Solano County",3]
[null,null,null,null,null,null,null,null,null,null,null,null,null,"California","Sonoma County",3]
[null,null,null,null,null,null,null,null,null,null,null,null,null,"California","Stanislaus County",3]
[null,null,null,null,null,null,null,null,null,null,null,null,null,"California","Sutter County",3]
[null,null,null,null,null,null,null,null,null,null,null,null,null,"California","Tehama County",3]
[null,null,null,null,null,null,null,null,null,null,null,null,null,"California","Trinity County",3]
[null,null,null,null,null,null,null,null,null,null,null,null,null,"California","Tulare County",3]
[null,null,null,null,null,null,null,null,null,null,null,null,null,"California","Tuolumne County",3]
[null,null,null,null,null,null,null,null,null,null,null,null,null,"California","Ventura County",3]
[null,null,null,null,null,null,null,null,null,null,null,null,null,"California","Yolo County",3]
[null,null,null,null,null,null,null,null,null,null,null,null,null,"California","Yuba County",3]
[null,null,null,null,null,null,null,null,null,null,null,null,null,"Colorado","Adams County",3]
[null,null,null,null,null,null,null,null,null,null,null,null,null,"Colorado","Alamosa County",3]
[null,null,null,null,null,null,null,null,null,null,null,null,null,"Colorado","Arapahoe County",3]
[null,null,null,null,null,null,null,null,null,null,null,null,null,"Colorado","Archuleta County",3]
[null,null,null,null,null,null,null,null,null,null,null,null,null,"Colorado","Baca County",3]
[null,null,null,null,null,null,null,null,null,null,null,null,null,"Colorado","Bent County",3]
[null,null,null,null,null,null,null,null,null,null,null,null,null,"Colorado","Boulder County",3]
[null,null,null,null,null,null,null,null,null,null,null,null,null,"Colorado","Broomfield County",3]
[null,null,null,null,null,null,null,null,null,null,null,null,null,"Colorado","Chaffee County",6]
[null,null,null,null,null,null,null,null,null,null,null,null,null,"Colorado","Cheyenne County",3]
[null,null,null,null,null,null,null,null,null,null,null,null,null,"Colorado","Clear Creek County",3]
[null,null,null,null,null,null,null,null,null,null,null,null,null,"Colorado","Conejos County",3]
[null,null,null,null,null,null,null,null,null,null,null,null,null,"Colorado","Costilla County",6]
[null,null,null,null,null,null,null,null,null,null,null,null,null,"Colorado","Crowley County",3]
[null,null,null,null,null,null,null,null,null,null,null,null,null,"Colorado","Custer County",6]
[null,null,null,null,null,null,null,null,null,null,null,null,null,"Colorado","Delta County",3]
[null,null,null,null,null,null,null,null,null,null,null,null,null,"Colorado","Denver County",3]
[null,null,null,null,null,null,null,null,null,null,null,null,null,"Colorado","Dolores County",3]
[null,null,null,null,null,null,null,null,null,null,null,null,null,"Colorado","Douglas County",3]
[null,null,null,null,null,null,null,null,null,null,null,null,null,"Colorado","Eagle County",3]
[null,null,null,null,null,null,null,null,null,null,null,null,null,"Colorado","El Paso County",3]
[null,null,null,null,null,null,null,null,null,null,null,null,null,"Colorado","Elbert County",3]
[null,null,null,null,null,null,null,null,null,null,null,null,null,"Colorado","Fremont County",3]
[null,null,null,null,null,null,null,null,null,null,null,null,null,"Colorado","Garfield County",3]
[null,null,null,null,null,null,null,null,null,null,null,null,null,"Colorado","Gilpin County",3]
[null,null,null,null,null,null,null,null,null,null,null,null,null,"Colorado","Grand County",3]
[null,null,null,null,null,null,null,null,null,null,null,null,null,"Colorado","Gunnison County",3]
[null,null,null,null,null,null,null,null,null,null,null,null,null,"Colorado","Hinsdale County",3]
[null,null,null,null,null,null,null,null,null,null,null,null,null,"Colorado","Huerfano County",3]
[null,null,null,null,null,null,null,null,null,null,null,null,null,"Colorado","Jackson County",3]
[null,null,null,null,null,null,null,null,null,null,null,null,null,"Colorado","Jefferson County",3]
[null,null,null,null,null,null,null,null,null,null,null,null,null,"Colorado","Kiowa County",3]
[null,null,null,null,null,null,null,null,null,null,null,null,null,"Colorado","Kit Carson County",3]
[null,null,null,null,null,null,null,null,null,null,null,null,null,"Colorado","La Plata County",3]
[null,null,null,null,null,null,null,null,null,null,null,null,null,"Colorado","Lake County",3]
[null,null,null,null,null,null,null,null,null,null,null,null,null,"Colorado","Larimer County",3]
[null,null,null,null,null,null,null,null,null,null,null,null,null,"Colorado","Las Animas County",3]
[null,null,null,null,null,null,null,null,null,null,null,null,null,"Colorado","Lincoln County",3]
[null,null,null,null,null,null,null,null,null,null,null,null,null,"Colorado","Logan County",3]
[null,null,null,null,null,null,null,null,null,null,null,null,null,"Colorado","Mesa County",6]
[null,null,null,null,null,null,null,null,null,null,null,null,null,"Colorado","Mineral County",3]
[null,null,null,null,null,null,null,null,null,null,null,null,null,"Colorado","Moffat County",3]
[null,null,null,null,null,null,null,null,null,null,null,null,null,"Colorado","Montezuma County",3]
[null,null,null,null,null,null,null,null,null,null,null,null,null,"Colorado","Montrose County",6]
[null,null,null,null,null,null,null,null,null,null,null,null,null,"Colorado","Morgan County",3]
[null,null,null,null,null,null,null,null,null,null,null,null,null,"Colorado","Otero County",3]
[null,null,null,null,null,null,null,null,null,null,null,null,null,"Colorado","Ouray County",3]
[null,null,null,null,null,null,null,null,null,null,null,null,null,"Colorado","Park County",3]
[null,null,null,null,null,null,null,null,null,null,null,null,null,"Colorado","Phillips County",3]
[null,null,null,null,null,null,null,null,null,null,null,null,null,"Colorado","Pitkin County",3]
[null,null,null,null,null,null,null,null,null,null,null,null,null,"Colorado","Prowers County",3]
[null,null,null,null,null,null,null,null,null,null,null,null,null,"Colorado","Pueblo County",3]
[null,null,null,null,null,null,null,null,null,null,null,null,null,"Colorado","Rio Blanco County",3]
[null,null,null,null,null,null,null,null,null,null,null,null,null,"Colorado","Rio Grande County",3]
[null,null,null,null,null,null,null,null,null,null,null,null,null,"Colorado","Routt County",3]
[null,null,null,null,null,null,null,null,null,null,null,null,null,"Colorado","Saguache County",3]
[null,null,null,null,null,null,null,null,null,null,null,null,null,"Colorado","San Juan County",3]
[null,null,null,null,null,null,null,null,null,null,null,null,null,"Colorado","San Miguel County",6]
[null,null,null,null,null,null,null,null,null,null,null,null,null,"Colorado","Sedgwick County",3]
[null,null,null,null,null,null,null,null,null,null,null,null,null,"Colorado","Summit County",3]
[null,null,null,null,null,null,null,null,null,null,null,null,null,"Colorado","Teller County",3]
[null,null,null,null,null,null,null,null,null,null,null,null,null,"Colorado","Washington County",3]
[null,null,null,null,null,null,null,null,null,null,null,null,null,"Colorado","Weld County",3]
[null,null,null,null,null,null,null,null,null,null,null,null,null,"Colorado","Yuma County",3]
[null,null,null,null,null,null,null,null,null,null,null,null,null,"Connecticut","Capitol Planning Region",2]
[null,null,null,null,null,null,null,null,null,null,null,null,null,"Connecticut","Greater Bridgeport Planning Region",2]
[null,null,null,null,null,null,null,null,null,null,null,null,null,"Connecticut","Lower Connecticut River Valley Planning Region","Not Eligible for Credit"]
[null,null,null,null,null,null,null,null,null,null,null,null,null,"Connecticut","Naugatuck Valley Planning Region","Not Eligible for Credit"]
[null,null,null,null,null,null,null,null,null,null,null,null,null,"Connecticut","Northeastern Connecticut Planning Region",2]
[null,null,null,null,null,null,null,null,null,null,null,null,null,"Connecticut","Northwest Hills Planning Region",2]
[null,null,null,null,null,null,null,null,null,null,null,null,null,"Connecticut","South Central Connecticut Planning Region","Not Eligible for Credit"]
[null,null,null,null,null,null,null,null,null,null,null,null,null,"Connecticut","Southeastern Connecticut Planning Region","Not Eligible for Credit"]
[null,null,null,null,null,null,null,null,null,null,null,null,null,"Connecticut","Western Connecticut Planning Region",2]
[null,null,null,null,null,null,null,null,null,null,null,null,null,"Delaware","Kent County","Not Eligible for Credit"]
[null,null,null,null,null,null,null,null,null,null,null,null,null,"Delaware","New Castle County","Not Eligible for Credit"]
[null,null,null,null,null,null,null,null,null,null,null,null,null,"Delaware","Sussex County","Not Eligible for Credit"]
[null,null,null,null,null,null,null,null,null,null,null,null,null,"District of Columbia","District of Columbia",2]
[null,null,null,null,null,null,null,null,null,null,null,null,null,"Florida","Alachua County",2]
[null,null,null,null,null,null,null,null,null,null,null,null,null,"Florida","Baker County",2]
[null,null,null,null,null,null,null,null,null,null,null,null,null,"Florida","Bay County",3]
[null,null,null,null,null,null,null,null,null,null,null,null,null,"Florida","Bradford County",2]
[null,null,null,null,null,null,null,null,null,null,null,null,null,"Florida","Brevard County",3]
[null,null,null,null,null,null,null,null,null,null,null,null,null,"Florida","Broward County",3]
[null,null,null,null,null,null,null,null,null,null,null,null,null,"Florida","Calhoun County","Not Eligible for Credit"]
[null,null,null,null,null,null,null,null,null,null,null,null,null,"Florida","Charlotte County",3]
[null,null,null,null,null,null,null,null,null,null,null,null,null,"Florida","Citrus County",3]
[null,null,null,null,null,null,null,null,null,null,null,null,null,"Florida","Clay County",2]
[null,null,null,null,null,null,null,null,null,null,null,null,null,"Florida","Collier County",3]
[null,null,null,null,null,null,null,null,null,null,null,null,null,"Florida","Columbia County",2]
[null,null,null,null,null,null,null,null,null,null,null,null,null,"Florida","DeSoto County",3]
[null,null,null,null,null,null,null,null,null,null,null,null,null,"Florida","Dixie County",2]
[null,null,null,null,null,null,null,null,null,null,null,null,null,"Florida","Duval County",2]
[null,null,null,null,null,null,null,null,null,null,null,null,null,"Florida","Escambia County","Not Eligible for Credit"]
[null,null,null,null,null,null,null,null,null,null,null,null,null,"Florida","Flagler County",2]
[null,null,null,null,null,null,null,null,null,null,null,null,null,"Florida","Franklin County",3]
[null,null,null,null,null,null,null,null,null,null,null,null,null,"Florida","Gadsden County",2]
[null,null,null,null,null,null,null,null,null,null,null,null,null,"Florida","Gilchrist County",3]
[null,null,null,null,null,null,null,null,null,null,null,null,null,"Florida","Glades County",3]
[null,null,null,null,null,null,null,null,null,null,null,null,null,"Florida","Gulf County",2]
[null,null,null,null,null,null,null,null,null,null,null,null,null,"Florida","Hamilton County","Not Eligible for Credit"]
[null,null,null,null,null,null,null,null,null,null,null,null,null,"Florida","Hardee County",3]
[null,null,null,null,null,null,null,null,null,null,null,null,null,"Florida","Hendry County",3]
[null,null,null,null,null,null,null,null,null,null,null,null,null,"Florida","Hernando County",2]
[null,null,null,null,null,null,null,null,null,null,null,null,null,"Florida","Highlands County",3]
[null,null,null,null,null,null,null,null,null,null,null,null,null,"Florida","Hillsborough County",3]
[null,null,null,null,null,null,null,null,null,null,null,null,null,"Florida","Holmes County",2]
[null,null,null,null,null,null,null,null,null,null,null,null,null,"Florida","Indian River County",2]
[null,null,null,null,null,null,null,null,null,null,null,null,null,"Florida","Jackson County",2]
[null,null,null,null,null,null,null,null,null,null,null,null,null,"Florida","Jefferson County",2]
[null,null,null,null,null,null,null,null,null,null,null,null,null,"Florida","Lafayette County",2]
[null,null,null,null,null,null,null,null,null,null,null,null,null,"Florida","Lake County",3]
[null,null,null,null,null,null,null,null,null,null,null,null,null,"Florida","Lee County",3]
[null,null,null,null,null,null,null,null,null,null,null,null,null,"Florida","Leon County",2]
[null,null,null,null,null,null,null,null,null,null,null,null,null,"Florida","Levy County",2]
[null,null,null,null,null,null,null,null,null,null,null,null,null,"Florida","Liberty County",2]
[null,null,null,null,null,null,null,null,null,null,null,null,null,"Florida","Madison County",2]
[null,null,null,null,null,null,null,null,null,null,null,null,null,"Florida","Manatee County",3]
[null,null,null,null,null,null,null,null,null,null,null,null,null,"Florida","Marion County",3]
[null,null,null,null,null,null,null,null,null,null,null,null,null,"Florida","Martin County",2]
[null,null,null,null,null,null,null,null,null,null,null,null,null,"Florida","Miami-Dade County",2]
[null,null,null,null,null,null,null,null,null,null,null,null,null,"Florida","Monroe County",2]
[null,null,null,null,null,null,null,null,null,null,null,null,null,"Florida","Nassau County",2]
[null,null,null,null,null,null,null,null,null,null,null,null,null,"Florida","Okaloosa County",2]
[null,null,null,null,null,null,null,null,null,null,null,null,null,"Florida","Okeechobee County",3]
[null,null,null,null,null,null,null,null,null,null,null,null,null,"Florida","Orange County",3]
[null,null,null,null,null,null,null,null,null,null,null,null,null,"Florida","Osceola County",3]
[null,null,null,null,null,null,null,null,null,null,null,null,null,"Florida","Palm Beach County",3]
[null,null,null,null,null,null,null,null,null,null,null,null,null,"Florida","Pasco County",2]
[null,null,null,null,null,null,null,null,null,null,null,null,null,"Florida","Pinellas County",3]
[null,null,null,null,null,null,null,null,null,null,null,null,null,"Florida","Polk County",3]
[null,null,null,null,null,null,null,null,null,null,null,null,null,"Florida","Putnam County",3]
[null,null,null,null,null,null,null,null,null,null,null,null,null,"Florida","Santa Rosa County",2]
[null,null,null,null,null,null,null,null,null,null,null,null,null,"Florida","Sarasota County",3]
[null,null,null,null,null,null,null,null,null,null,null,null,null,"Florida","Seminole County",2]
[null,null,null,null,null,null,null,null,null,null,null,null,null,"Florida","St. Johns County",2]
[null,null,null,null,null,null,null,null,null,null,null,null,null,"Florida","St. Lucie County",2]
[null,null,null,null,null,null,null,null,null,null,null,null,null,"Florida","Sumter County",3]
[null,null,null,null,null,null,null,null,null,null,null,null,null,"Florida","Suwannee County",2]
[null,null,null,null,null,null,null,null,null,null,null,null,null,"Florida","Taylor County",2]
[null,null,null,null,null,null,null,null,null,null,null,null,null,"Florida","Union County",2]
[null,null,null,null,null,null,null,null,null,null,null,null,null,"Florida","Volusia County",3]
[null,null,null,null,null,null,null,null,null,null,null,null,null,"Florida","Wakulla County",2]
[null,null,null,null,null,null,null,null,null,null,null,null,null,"Florida","Walton County",2]
[null,null,null,null,null,null,null,null,null,null,null,null,null,"Florida","Washington County",2]
[null,null,null,null,null,null,null,null,null,null,null,null,null,"Georgia","Appling County",2]
[null,null,null,null,null,null,null,null,null,null,null,null,null,"Georgia","Atkinson County",2]
[null,null,null,null,null,null,null,null,null,null,null,null,null,"Georgia","Bacon County",2]
[null,null,null,null,null,null,null,null,null,null,null,null,null,"Georgia","Baker County",2]
[null,null,null,null,null,null,null,null,null,null,null,null,null,"Georgia","Baldwin County",2]
[null,null,null,null,null,null,null,null,null,null,null,null,null,"Georgia","Banks County",2]
[null,null,null,null,null,null,null,null,null,null,null,null,null,"Georgia","Barrow County",2]
[null,null,null,null,null,null,null,null,null,null,null,null,null,"Georgia","Bartow County",2]
[null,null,null,null,null,null,null,null,null,null,null,null,null,"Georgia","Ben Hill County",2]
[null,null,null,null,null,null,null,null,null,null,null,null,null,"Georgia","Berrien County",2]
[null,null,null,null,null,null,null,null,null,null,null,null,null,"Georgia","Bibb County",2]
[null,null,null,null,null,null,null,null,null,null,null,null,null,"Georgia","Bleckley County",2]
[null,null,null,null,null,null,null,null,null,null,null,null,null,"Georgia","Brantley County",2]
[null,null,null,null,null,null,null,null,null,null,null,null,null,"Georgia","Brooks County",2]
[null,null,null,null,null,null,null,null,null,null,null,null,null,"Georgia","Bryan County",2]
[null,null,null,null,null,null,null,null,null,null,null,null,null,"Georgia","Bulloch County",2]
[null,null,null,null,null,null,null,null,null,null,null,null,null,"Georgia","Burke County",2]
[null,null,null,null,null,null,null,null,null,null,null,null,null,"Georgia","Butts County",3]
[null,null,null,null,null,null,null,null,null,null,null,null,null,"Georgia","Calhoun County",2]
[null,null,null,null,null,null,null,null,null,null,null,null,null,"Georgia","Camden County",2]
[null,null,null,null,null,null,null,null,null,null,null,null,null,"Georgia","Candler County",2]
[null,null,null,null,null,null,null,null,null,null,null,null,null,"Georgia","Carroll County",2]
[null,null,null,null,null,null,null,null,null,null,null,null,null,"Georgia","Catoosa County",2]
[null,null,null,null,null,null,null,null,null,null,null,null,null,"Georgia","Charlton County",2]
[null,null,null,null,null,null,null,null,null,null,null,null,null,"Georgia","Chatham County",2]
[null,null,null,null,null,null,null,null,null,null,null,null,null,"Georgia","Chattahoochee County",2]
[null,null,null,null,null,null,null,null,null,null,null,null,null,"Georgia","Chattooga County","Not Eligible for Credit"]
[null,null,null,null,null,null,null,null,null,null,null,null,null,"Georgia","Cherokee County",3]
[null,null,null,null,null,null,null,null,null,null,null,null,null,"Georgia","Clarke County",2]
[null,null,null,null,null,null,null,null,null,null,null,null,null,"Georgia","Clay County",2]
[null,null,null,null,null,null,null,null,null,null,null,null,null,"Georgia","Clayton County",2]
[null,null,null,null,null,null,null,null,null,null,null,null,null,"Georgia","Clinch County",2]
[null,null,null,null,null,null,null,null,null,null,null,null,null,"Georgia","Cobb County",3]
[null,null,null,null,null,null,null,null,null,null,null,null,null,"Georgia","Coffee County",2]
[null,null,null,null,null,null,null,null,null,null,null,null,null,"Georgia","Colquitt County",2]
[null,null,null,null,null,null,null,null,null,null,null,null,null,"Georgia","Columbia County",2]
[null,null,null,null,null,null,null,null,null,null,null,null,null,"Georgia","Cook County",2]
[null,null,null,null,null,null,null,null,null,null,null,null,null,"Georgia","Coweta County",3]
[null,null,null,null,null,null,null,null,null,null,null,null,null,"Georgia","Crawford County",3]
[null,null,null,null,null,null,null,null,null,null,null,null,null,"Georgia","Crisp County",2]
[null,null,null,null,null,null,null,null,null,null,null,null,null,"Georgia","Dade County",2]
[null,null,null,null,null,null,null,null,null,null,null,null,null,"Georgia","Dawson County",2]
[null,null,null,null,null,null,null,null,null,null,null,null,null,"Georgia","Decatur County",2]
[null,null,null,null,null,null,null,null,null,null,null,null,null,"Georgia","DeKalb County",3]
[null,null,null,null,null,null,null,null,null,null,null,null,null,"Georgia","Dodge County",2]
[null,null,null,null,null,null,null,null,null,null,null,null,null,"Georgia","Dooly County",2]
[null,null,null,null,null,null,null,null,null,null,null,null,null,"Georgia","Dougherty County",2]
[null,null,null,null,null,null,null,null,null,null,null,null,null,"Georgia","Douglas County",2]
[null,null,null,null,null,null,null,null,null,null,null,null,null,"Georgia","Early County",2]
[null,null,null,null,null,null,null,null,null,null,null,null,null,"Georgia","Echols County",2]
[null,null,null,null,null,null,null,null,null,null,null,null,null,"Georgia","Effingham County",2]
[null,null,null,null,null,null,null,null,null,null,null,null,null,"Georgia","Elbert County",2]
[null,null,null,null,null,null,null,null,null,null,null,null,null,"Georgia","Emanuel County",2]
[null,null,null,null,null,null,null,null,null,null,null,null,null,"Georgia","Evans County",2]
[null,null,null,null,null,null,null,null,null,null,null,null,null,"Georgia","Fannin County",2]
[null,null,null,null,null,null,null,null,null,null,null,null,null,"Georgia","Fayette County",2]
[null,null,null,null,null,null,null,null,null,null,null,null,null,"Georgia","Floyd County",2]
[null,null,null,null,null,null,null,null,null,null,null,null,null,"Georgia","Forsyth County",2]
[null,null,null,null,null,null,null,null,null,null,null,null,null,"Georgia","Franklin County",2]
[null,null,null,null,null,null,null,null,null,null,null,null,null,"Georgia","Fulton County",3]
[null,null,null,null,null,null,null,null,null,null,null,null,null,"Georgia","Gilmer County",2]
[null,null,null,null,null,null,null,null,null,null,null,null,null,"Georgia","Glascock County",2]
[null,null,null,null,null,null,null,null,null,null,null,null,null,"Georgia","Glynn County",3]
[null,null,null,null,null,null,null,null,null,null,null,null,null,"Georgia","Gordon County",2]
[null,null,null,null,null,null,null,null,null,null,null,null,null,"Georgia","Grady County",2]
[null,null,null,null,null,null,null,null,null,null,null,null,null,"Georgia","Greene County","Not Eligible for Credit"]
[null,null,null,null,null,null,null,null,null,null,null,null,null,"Georgia","Gwinnett County",3]
[null,null,null,null,null,null,null,null,null,null,null,null,null,"Georgia","Habersham County",2]
[null,null,null,null,null,null,null,null,null,null,null,null,null,"Georgia","Hall County",2]
[null,null,null,null,null,null,null,null,null,null,null,null,null,"Georgia","Hancock County",2]
[null,null,null,null,null,null,null,null,null,null,null,null,null,"Georgia","Haralson County",2]
[null,null,null,null,null,null,null,null,null,null,null,null,null,"Georgia","Harris County",2]
[null,null,null,null,null,null,null,null,null,null,null,null,null,"Georgia","Hart County",2]
[null,null,null,null,null,null,null,null,null,null,null,null,null,"Georgia","Heard County",2]
[null,null,null,null,null,null,null,null,null,null,null,null,null,"Georgia","Henry County",3]
[null,null,null,null,null,null,null,null,null,null,null,null,null,"Georgia","Houston County",2]
[null,null,null,null,null,null,null,null,null,null,null,null,null,"Georgia","Irwin County",2]
[null,null,null,null,null,null,null,null,null,null,null,null,null,"Georgia","Jackson County",3]
[null,null,null,null,null,null,null,null,null,null,null,null,null,"Georgia","Jasper County",3]
[null,null,null,null,null,null,null,null,null,null,null,null,null,"Georgia","Jeff Davis County","Not Eligible for Credit"]
[null,null,null,null,null,null,null,null,null,null,null,null,null,"Georgia","Jefferson County",2]
[null,null,null,null,null,null,null,null,null,null,null,null,null,"Georgia","Jenkins County",2]
[null,null,null,null,null,null,null,null,null,null,null,null,null,"Georgia","Johnson County",2]
[null,null,null,null,null,null,null,null,null,null,null,null,null,"Georgia","Jones County",3]
[null,null,null,null,null,null,null,null,null,null,null,null,null,"Georgia","Lamar County",2]
[null,null,null,null,null,null,null,null,null,null,null,null,null,"Georgia","Lanier County",2]
[null,null,null,null,null,null,null,null,null,null,null,null,null,"Georgia","Laurens County",2]
[null,null,null,null,null,null,null,null,null,null,null,null,null,"Georgia","Lee County",2]
[null,null,null,null,null,null,null,null,null,null,null,null,null,"Georgia","Liberty County",2]
[null,null,null,null,null,null,null,null,null,null,null,null,null,"Georgia","Lincoln County",2]
[null,null,null,null,null,null,null,null,null,null,null,null,null,"Georgia","Long County",2]
[null,null,null,null,null,null,null,null,null,null,null,null,null,"Georgia","Lowndes County",2]
[null,null,null,null,null,null,null,null,null,null,null,null,null,"Georgia","Lumpkin County",2]
[null,null,null,null,null,null,null,null,null,null,null,null,null,"Georgia","Macon County",2]
[null,null,null,null,null,null,null,null,null,null,null,null,null,"Georgia","Madison County",3]
[null,null,null,null,null,null,null,null,null,null,null,null,null,"Georgia","Marion County",2]
[null,null,null,null,null,null,null,null,null,null,null,null,null,"Georgia","McDuffie County",2]
[null,null,null,null,null,null,null,null,null,null,null,null,null,"Georgia","McIntosh County",2]
[null,null,null,null,null,null,null,null,null,null,null,null,null,"Georgia","Meriwether County",3]
[null,null,null,null,null,null,null,null,null,null,null,null,null,"Georgia","Miller County",2]
[null,null,null,null,null,null,null,null,null,null,null,null,null,"Georgia","Mitchell County",2]
[null,null,null,null,null,null,null,null,null,null,null,null,null,"Georgia","Monroe County",2]
[null,null,null,null,null,null,null,null,null,null,null,null,null,"Georgia","Montgomery County",2]
[null,null,null,null,null,null,null,null,null,null,null,null,null,"Georgia","Morgan County",2]
[null,null,null,null,null,null,null,null,null,null,null,null,null,"Georgia","Murray County",2]
[null,null,null,null,null,null,null,null,null,null,null,null,null,"Georgia","Muscogee County",2]
[null,null,null,null,null,null,null,null,null,null,null,null,null,"Georgia","Newton County",3]
[null,null,null,null,null,null,null,null,null,null,null,null,null,"Georgia","Oconee County",2]
[null,null,null,null,null,null,null,null,null,null,null,null,null,"Georgia","Oglethorpe County",2]
[null,null,null,null,null,null,null,null,null,null,null,null,null,"Georgia","Paulding County",2]
[null,null,null,null,null,null,null,null,null,null,null,null,null,"Georgia","Peach County",2]
[null,null,null,null,null,null,null,null,null,null,null,null,null,"Georgia","Pickens County",2]
[null,null,null,null,null,null,null,null,null,null,null,null,null,"Georgia","Pierce County",2]
[null,null,null,null,null,null,null,null,null,null,null,null,null,"Georgia","Pike County",2]
[null,null,null,null,null,null,null,null,null,null,null,null,null,"Georgia","Polk County",2]
[null,null,null,null,null,null,null,null,null,null,null,null,null,"Georgia","Pulaski County",2]
[null,null,null,null,null,null,null,null,null,null,null,null,null,"Georgia","Putnam County",2]
[null,null,null,null,null,null,null,null,null,null,null,null,null,"Georgia","Quitman County","Not Eligible for Credit"]
[null,null,null,null,null,null,null,null,null,null,null,null,null,"Georgia","Rabun County","Not Eligible for Credit"]
[null,null,null,null,null,null,null,null,null,null,null,null,null,"Georgia","Randolph County",2]
[null,null,null,null,null,null,null,null,null,null,null,null,null,"Georgia","Richmond County",2]
[null,null,null,null,null,null,null,null,null,null,null,null,null,"Georgia","Rockdale County",3]
[null,null,null,null,null,null,null,null,null,null,null,null,null,"Georgia","Schley County",2]
[null,null,null,null,null,null,null,null,null,null,null,null,null,"Georgia","Screven County","Not Eligible for Credit"]
[null,null,null,null,null,null,null,null,null,null,null,null,null,"Georgia","Seminole County",2]
[null,null,null,null,null,null,null,null,null,null,null,null,null,"Georgia","Spalding County",2]
[null,null,null,null,null,null,null,null,null,null,null,null,null,"Georgia","Stephens County",2]
[null,null,null,null,null,null,null,null,null,null,null,null,null,"Georgia","Stewart County",2]
[null,null,null,null,null,null,null,null,null,null,null,null,null,"Georgia","Sumter County",2]
[null,null,null,null,null,null,null,null,null,null,null,null,null,"Georgia","Talbot County","Not Eligible for Credit"]
[null,null,null,null,null,null,null,null,null,null,null,null,null,"Georgia","Taliaferro County",2]
[null,null,null,null,null,null,null,null,null,null,null,null,null,"Georgia","Tattnall County",2]
[null,null,null,null,null,null,null,null,null,null,null,null,null,"Georgia","Taylor County",2]
[null,null,null,null,null,null,null,null,null,null,null,null,null,"Georgia","Telfair County",2]
[null,null,null,null,null,null,null,null,null,null,null,null,null,"Georgia","Terrell County",2]
[null,null,null,null,null,null,null,null,null,null,null,null,null,"Georgia","Thomas County",2]
[null,null,null,null,null,null,null,null,null,null,null,null,null,"Georgia","Tift County",2]
[null,null,null,null,null,null,null,null,null,null,null,null,null,"Georgia","Toombs County",2]
[null,null,null,null,null,null,null,null,null,null,null,null,null,"Georgia","Towns County",2]
[null,null,null,null,null,null,null,null,null,null,null,null,null,"Georgia","Treutlen County",2]
[null,null,null,null,null,null,null,null,null,null,null,null,null,"Georgia","Troup County",2]
[null,null,null,null,null,null,null,null,null,null,null,null,null,"Georgia","Turner County",2]
[null,null,null,null,null,null,null,null,null,null,null,null,null,"Georgia","Twiggs County",2]
[null,null,null,null,null,null,null,null,null,null,null,null,null,"Georgia","Union County",2]
[null,null,null,null,null,null,null,null,null,null,null,null,null,"Georgia","Upson County",2]
[null,null,null,null,null,null,null,null,null,null,null,null,null,"Georgia","Walker County",2]
[null,null,null,null,null,null,null,null,null,null,null,null,null,"Georgia","Walton County",2]
[null,null,null,null,null,null,null,null,null,null,null,null,null,"Georgia","Ware County",2]
[null,null,null,null,null,null,null,null,null,null,null,null,null,"Georgia","Warren County","Not Eligible for Credit"]
[null,null,null,null,null,null,null,null,null,null,null,null,null,"Georgia","Washington County",2]
[null,null,null,null,null,null,null,null,null,null,null,null,null,"Georgia","Wayne County",2]
[null,null,null,null,null,null,null,null,null,null,null,null,null,"Georgia","Webster County",2]
[null,null,null,null,null,null,null,null,null,null,null,null,null,"Georgia","Wheeler County",2]
[null,null,null,null,null,null,null,null,null,null,null,null,null,"Georgia","White County",2]
[null,null,null,null,null,null,null,null,null,null,null,null,null,"Georgia","Whitfield County","Not Eligible for Credit"]
[null,null,null,null,null,null,null,null,null,null,null,null,null,"Georgia","Wilcox County",2]
[null,null,null,null,null,null,null,null,null,null,null,null,null,"Georgia","Wilkes County",2]
[null,null,null,null,null,null,null,null,null,null,null,null,null,"Georgia","Wilkinson County",2]
[null,null,null,null,null,null,null,null,null,null,null,null,null,"Georgia","Worth County",2]
[null,null,null,null,null,null,null,null,null,null,null,null,null,"Idaho","Ada County",3]
[null,null,null,null,null,null,null,null,null,null,null,null,null,"Idaho","Adams County",3]
[null,null,null,null,null,null,null,null,null,null,null,null,null,"Idaho","Bannock County",3]
[null,null,null,null,null,null,null,null,null,null,null,null,null,"Idaho","Bear Lake County",3]
[null,null,null,null,null,null,null,null,null,null,null,null,null,"Idaho","Benewah County",2]
[null,null,null,null,null,null,null,null,null,null,null,null,null,"Idaho","Bingham County",3]
[null,null,null,null,null,null,null,null,null,null,null,null,null,"Idaho","Blaine County",3]
[null,null,null,null,null,null,null,null,null,null,null,null,null,"Idaho","Boise County",3]
[null,null,null,null,null,null,null,null,null,null,null,null,null,"Idaho","Bonner County",2]
[null,null,null,null,null,null,null,null,null,null,null,null,null,"Idaho","Bonneville County",3]
[null,null,null,null,null,null,null,null,null,null,null,null,null,"Idaho","Boundary County",2]
[null,null,null,null,null,null,null,null,null,null,null,null,null,"Idaho","Butte County",3]
[null,null,null,null,null,null,null,null,null,null,null,null,null,"Idaho","Camas County",3]
[null,null,null,null,null,null,null,null,null,null,null,null,null,"Idaho","Canyon County",6]
[null,null,null,null,null,null,null,null,null,null,null,null,null,"Idaho","Caribou County",2]
[null,null,null,null,null,null,null,null,null,null,null,null,null,"Idaho","Cassia County",3]
[null,null,null,null,null,null,null,null,null,null,null,null,null,"Idaho","Clark County",3]
[null,null,null,null,null,null,null,null,null,null,null,null,null,"Idaho","Clearwater County",2]
[null,null,null,null,null,null,null,null,null,null,null,null,null,"Idaho","Custer County",3]
[null,null,null,null,null,null,null,null,null,null,null,null,null,"Idaho","Elmore County",3]
[null,null,null,null,null,null,null,null,null,null,null,null,null,"Idaho","Franklin County",3]
[null,null,null,null,null,null,null,null,null,null,null,null,null,"Idaho","Fremont County",2]
[null,null,null,null,null,null,null,null,null,null,null,null,null,"Idaho","Gem County",3]
[null,null,null,null,null,null,null,null,null,null,null,null,null,"Idaho","Gooding County",3]
[null,null,null,null,null,null,null,null,null,null,null,null,null,"Idaho","Idaho County",3]
[null,null,null,null,null,null,null,null,null,null,null,null,null,"Idaho","Jefferson County",3]
[null,null,null,null,null,null,null,null,null,null,null,null,null,"Idaho","Jerome County",3]
[null,null,null,null,null,null,null,null,null,null,null,null,null,"Idaho","Kootenai County",3]
[null,null,null,null,null,null,null,null,null,null,null,null,null,"Idaho","Latah County",3]
[null,null,null,null,null,null,null,null,null,null,null,null,null,"Idaho","Lemhi County",3]
[null,null,null,null,null,null,null,null,null,null,null,null,null,"Idaho","Lewis County",3]
[null,null,null,null,null,null,null,null,null,null,null,null,null,"Idaho","Lincoln County",3]
[null,null,null,null,null,null,null,null,null,null,null,null,null,"Idaho","Madison County",3]
[null,null,null,null,null,null,null,null,null,null,null,null,null,"Idaho","Minidoka County",3]
[null,null,null,null,null,null,null,null,null,null,null,null,null,"Idaho","Nez Perce County",3]
[null,null,null,null,null,null,null,null,null,null,null,null,null,"Idaho","Oneida County",3]
[null,null,null,null,null,null,null,null,null,null,null,null,null,"Idaho","Owyhee County",3]
[null,null,null,null,null,null,null,null,null,null,null,null,null,"Idaho","Payette County",6]
[null,null,null,null,null,null,null,null,null,null,null,null,null,"Idaho","Power County",3]
[null,null,null,null,null,null,null,null,null,null,null,null,null,"Idaho","Shoshone County",3]
[null,null,null,null,null,null,null,null,null,null,null,null,null,"Idaho","Teton County",2]
[null,null,null,null,null,null,null,null,null,null,null,null,null,"Idaho","Twin Falls County",3]
[null,null,null,null,null,null,null,null,null,null,null,null,null,"Idaho","Valley County",3]
[null,null,null,null,null,null,null,null,null,null,null,null,null,"Idaho","Washington County",3]
[null,null,null,null,null,null,null,null,null,null,null,null,null,"Illinois","Adams County",2]
[null,null,null,null,null,null,null,null,null,null,null,null,null,"Illinois","Alexander County",2]
[null,null,null,null,null,null,null,null,null,null,null,null,null,"Illinois","Bond County","Not Eligible for Credit"]
[null,null,null,null,null,null,null,null,null,null,null,null,null,"Illinois","Boone County",2]
[null,null,null,null,null,null,null,null,null,null,null,null,null,"Illinois","Brown County",2]
[null,null,null,null,null,null,null,null,null,null,null,null,null,"Illinois","Bureau County",2]
[null,null,null,null,null,null,null,null,null,null,null,null,null,"Illinois","Calhoun County",2]
[null,null,null,null,null,null,null,null,null,null,null,null,null,"Illinois","Carroll County",2]
[null,null,null,null,null,null,null,null,null,null,null,null,null,"Illinois","Cass County",2]
[null,null,null,null,null,null,null,null,null,null,null,null,null,"Illinois","Champaign County",2]
[null,null,null,null,null,null,null,null,null,null,null,null,null,"Illinois","Christian County",2]
[null,null,null,null,null,null,null,null,null,null,null,null,null,"Illinois","Clark County","Not Eligible for Credit"]
[null,null,null,null,null,null,null,null,null,null,null,null,null,"Illinois","Clay County",2]
[null,null,null,null,null,null,null,null,null,null,null,null,null,"Illinois","Clinton County",2]
[null,null,null,null,null,null,null,null,null,null,null,null,null,"Illinois","Coles County",2]
[null,null,null,null,null,null,null,null,null,null,null,null,null,"Illinois","Cook County",2]
[null,null,null,null,null,null,null,null,null,null,null,null,null,"Illinois","Crawford County",2]
[null,null,null,null,null,null,null,null,null,null,null,null,null,"Illinois","Cumberland County",2]
[null,null,null,null,null,null,null,null,null,null,null,null,null,"Illinois","De Witt County",2]
[null,null,null,null,null,null,null,null,null,null,null,null,null,"Illinois","DeKalb County",2]
[null,null,null,null,null,null,null,null,null,null,null,null,null,"Illinois","Douglas County",2]
[null,null,null,null,null,null,null,null,null,null,null,null,null,"Illinois","DuPage County",2]
[null,null,null,null,null,null,null,null,null,null,null,null,null,"Illinois","Edgar County",2]
[null,null,null,null,null,null,null,null,null,null,null,null,null,"Illinois","Edwards County",2]
[null,null,null,null,null,null,null,null,null,null,null,null,null,"Illinois","Effingham County",2]
[null,null,null,null,null,null,null,null,null,null,null,null,null,"Illinois","Fayette County",2]
[null,null,null,null,null,null,null,null,null,null,null,null,null,"Illinois","Ford County",2]
[null,null,null,null,null,null,null,null,null,null,null,null,null,"Illinois","Franklin County",2]
[null,null,null,null,null,null,null,null,null,null,null,null,null,"Illinois","Fulton County",2]
[null,null,null,null,null,null,null,null,null,null,null,null,null,"Illinois","Gallatin County",2]
[null,null,null,null,null,null,null,null,null,null,null,null,null,"Illinois","Greene County",2]
[null,null,null,null,null,null,null,null,null,null,null,null,null,"Illinois","Grundy County",2]
[null,null,null,null,null,null,null,null,null,null,null,null,null,"Illinois","Hamilton County",2]
[null,null,null,null,null,null,null,null,null,null,null,null,null,"Illinois","Hancock County",2]
[null,null,null,null,null,null,null,null,null,null,null,null,null,"Illinois","Hardin County","Not Eligible for Credit"]
[null,null,null,null,null,null,null,null,null,null,null,null,null,"Illinois","Henderson County",2]
[null,null,null,null,null,null,null,null,null,null,null,null,null,"Illinois","Henry County",2]
[null,null,null,null,null,null,null,null,null,null,null,null,null,"Illinois","Iroquois County",2]
[null,null,null,null,null,null,null,null,null,null,null,null,null,"Illinois","Jackson County","Not Eligible for Credit"]
[null,null,null,null,null,null,null,null,null,null,null,null,null,"Illinois","Jasper County",2]
[null,null,null,null,null,null,null,null,null,null,null,null,null,"Illinois","Jefferson County",2]
[null,null,null,null,null,null,null,null,null,null,null,null,null,"Illinois","Jersey County",2]
[null,null,null,null,null,null,null,null,null,null,null,null,null,"Illinois","Jo Daviess County",2]
[null,null,null,null,null,null,null,null,null,null,null,null,null,"Illinois","Johnson County",2]
[null,null,null,null,null,null,null,null,null,null,null,null,null,"Illinois","Kane County",2]
[null,null,null,null,null,null,null,null,null,null,null,null,null,"Illinois","Kankakee County",2]
[null,null,null,null,null,null,null,null,null,null,null,null,null,"Illinois","Kendall County",2]
[null,null,null,null,null,null,null,null,null,null,null,null,null,"Illinois","Knox County",2]
[null,null,null,null,null,null,null,null,null,null,null,null,null,"Illinois","Lake County",2]
[null,null,null,null,null,null,null,null,null,null,null,null,null,"Illinois","LaSalle County",2]
[null,null,null,null,null,null,null,null,null,null,null,null,null,"Illinois","Lawrence County","Not Eligible for Credit"]
[null,null,null,null,null,null,null,null,null,null,null,null,null,"Illinois","Lee County",2]
[null,null,null,null,null,null,null,null,null,null,null,null,null,"Illinois","Livingston County",2]
[null,null,null,null,null,null,null,null,null,null,null,null,null,"Illinois","Logan County",2]
[null,null,null,null,null,null,null,null,null,null,null,null,null,"Illinois","Macon County",2]
[null,null,null,null,null,null,null,null,null,null,null,null,null,"Illinois","Macoupin County",2]
[null,null,null,null,null,null,null,null,null,null,null,null,null,"Illinois","Madison County",2]
[null,null,null,null,null,null,null,null,null,null,null,null,null,"Illinois","Marion County",2]
[null,null,null,null,null,null,null,null,null,null,null,null,null,"Illinois","Marshall County",2]
[null,null,null,null,null,null,null,null,null,null,null,null,null,"Illinois","Mason County",2]
[null,null,null,null,null,null,null,null,null,null,null,null,null,"Illinois","Massac County","Not Eligible for Credit"]
[null,null,null,null,null,null,null,null,null,null,null,null,null,"Illinois","McDonough County",2]
[null,null,null,null,null,null,null,null,null,null,null,null,null,"Illinois","McHenry County",2]
[null,null,null,null,null,null,null,null,null,null,null,null,null,"Illinois","McLean County",2]
[null,null,null,null,null,null,null,null,null,null,null,null,null,"Illinois","Menard County",2]
[null,null,null,null,null,null,null,null,null,null,null,null,null,"Illinois","Mercer County",2]
[null,null,null,null,null,null,null,null,null,null,null,null,null,"Illinois","Monroe County",2]
[null,null,null,null,null,null,null,null,null,null,null,null,null,"Illinois","Montgomery County",2]
[null,null,null,null,null,null,null,null,null,null,null,null,null,"Illinois","Morgan County",2]
[null,null,null,null,null,null,null,null,null,null,null,null,null,"Illinois","Moultrie County",2]
[null,null,null,null,null,null,null,null,null,null,null,null,null,"Illinois","Ogle County",2]
[null,null,null,null,null,null,null,null,null,null,null,null,null,"Illinois","Peoria County",2]
[null,null,null,null,null,null,null,null,null,null,null,null,null,"Illinois","Perry County","Not Eligible for Credit"]
[null,null,null,null,null,null,null,null,null,null,null,null,null,"Illinois","Piatt County",3]
[null,null,null,null,null,null,null,null,null,null,null,null,null,"Illinois","Pike County",2]
[null,null,null,null,null,null,null,null,null,null,null,null,null,"Illinois","Pope County",2]
[null,null,null,null,null,null,null,null,null,null,null,null,null,"Illinois","Pulaski County","Not Eligible for Credit"]
[null,null,null,null,null,null,null,null,null,null,null,null,null,"Illinois","Putnam County",2]
[null,null,null,null,null,null,null,null,null,null,null,null,null,"Illinois","Randolph County","Not Eligible for Credit"]
[null,null,null,null,null,null,null,null,null,null,null,null,null,"Illinois","Richland County","Not Eligible for Credit"]
[null,null,null,null,null,null,null,null,null,null,null,null,null,"Illinois","Rock Island County",2]
[null,null,null,null,null,null,null,null,null,null,null,null,null,"Illinois","Saline County",2]
[null,null,null,null,null,null,null,null,null,null,null,null,null,"Illinois","Sangamon County",2]
[null,null,null,null,null,null,null,null,null,null,null,null,null,"Illinois","Schuyler County",2]
[null,null,null,null,null,null,null,null,null,null,null,null,null,"Illinois","Scott County",2]
[null,null,null,null,null,null,null,null,null,null,null,null,null,"Illinois","Shelby County",2]
[null,null,null,null,null,null,null,null,null,null,null,null,null,"Illinois","St. Clair County",2]
[null,null,null,null,null,null,null,null,null,null,null,null,null,"Illinois","Stark County",2]
[null,null,null,null,null,null,null,null,null,null,null,null,null,"Illinois","Stephenson County",2]
[null,null,null,null,null,null,null,null,null,null,null,null,null,"Illinois","Tazewell County",2]
[null,null,null,null,null,null,null,null,null,null,null,null,null,"Illinois","Union County",2]
[null,null,null,null,null,null,null,null,null,null,null,null,null,"Illinois","Vermilion County",2]
[null,null,null,null,null,null,null,null,null,null,null,null,null,"Illinois","Wabash County","Not Eligible for Credit"]
[null,null,null,null,null,null,null,null,null,null,null,null,null,"Illinois","Warren County",3]
[null,null,null,null,null,null,null,null,null,null,null,null,null,"Illinois","Washington County",2]
[null,null,null,null,null,null,null,null,null,null,null,null,null,"Illinois","Wayne County",2]
[null,null,null,null,null,null,null,null,null,null,null,null,null,"Illinois","White County",2]
[null,null,null,null,null,null,null,null,null,null,null,null,null,"Illinois","Whiteside County",2]
[null,null,null,null,null,null,null,null,null,null,null,null,null,"Illinois","Will County",2]
[null,null,null,null,null,null,null,null,null,null,null,null,null,"Illinois","Williamson County",2]
[null,null,null,null,null,null,null,null,null,null,null,null,null,"Illinois","Winnebago County",2]
[null,null,null,null,null,null,null,null,null,null,null,null,null,"Illinois","Woodford County",2]
[null,null,null,null,null,null,null,null,null,null,null,null,null,"Indiana","Adams County",2]
[null,null,null,null,null,null,null,null,null,null,null,null,null,"Indiana","Allen County",2]
[null,null,null,null,null,null,null,null,null,null,null,null,null,"Indiana","Bartholomew County",2]
[null,null,null,null,null,null,null,null,null,null,null,null,null,"Indiana","Benton County",2]
[null,null,null,null,null,null,null,null,null,null,null,null,null,"Indiana","Blackford County",2]
[null,null,null,null,null,null,null,null,null,null,null,null,null,"Indiana","Boone County",3]
[null,null,null,null,null,null,null,null,null,null,null,null,null,"Indiana","Brown County",2]
[null,null,null,null,null,null,null,null,null,null,null,null,null,"Indiana","Carroll County",3]
[null,null,null,null,null,null,null,null,null,null,null,null,null,"Indiana","Cass County",3]
[null,null,null,null,null,null,null,null,null,null,null,null,null,"Indiana","Clark County",2]
[null,null,null,null,null,null,null,null,null,null,null,null,null,"Indiana","Clay County",2]
[null,null,null,null,null,null,null,null,null,null,null,null,null,"Indiana","Clinton County",2]
[null,null,null,null,null,null,null,null,null,null,null,null,null,"Indiana","Crawford County",2]
[null,null,null,null,null,null,null,null,null,null,null,null,null,"Indiana","Daviess County",2]
[null,null,null,null,null,null,null,null,null,null,null,null,null,"Indiana","Dearborn County",3]
[null,null,null,null,null,null,null,null,null,null,null,null,null,"Indiana","Decatur County",2]
[null,null,null,null,null,null,null,null,null,null,null,null,null,"Indiana","DeKalb County",2]
[null,null,null,null,null,null,null,null,null,null,null,null,null,"Indiana","Delaware County",2]
[null,null,null,null,null,null,null,null,null,null,null,null,null,"Indiana","Dubois County",2]
[null,null,null,null,null,null,null,null,null,null,null,null,null,"Indiana","Elkhart County",2]
[null,null,null,null,null,null,null,null,null,null,null,null,null,"Indiana","Fayette County",2]
[null,null,null,null,null,null,null,null,null,null,null,null,null,"Indiana","Floyd County",2]
[null,null,null,null,null,null,null,null,null,null,null,null,null,"Indiana","Fountain County",2]
[null,null,null,null,null,null,null,null,null,null,null,null,null,"Indiana","Franklin County",2]
[null,null,null,null,null,null,null,null,null,null,null,null,null,"Indiana","Fulton County",2]
[null,null,null,null,null,null,null,null,null,null,null,null,null,"Indiana","Gibson County",2]
[null,null,null,null,null,null,null,null,null,null,null,null,null,"Indiana","Grant County",2]
[null,null,null,null,null,null,null,null,null,null,null,null,null,"Indiana","Greene County",2]
[null,null,null,null,null,null,null,null,null,null,null,null,null,"Indiana","Hamilton County",3]
[null,null,null,null,null,null,null,null,null,null,null,null,null,"Indiana","Hancock County",2]
[null,null,null,null,null,null,null,null,null,null,null,null,null,"Indiana","Harrison County",2]
[null,null,null,null,null,null,null,null,null,null,null,null,null,"Indiana","Hendricks County",2]
[null,null,null,null,null,null,null,null,null,null,null,null,null,"Indiana","Henry County",2]
[null,null,null,null,null,null,null,null,null,null,null,null,null,"Indiana","Howard County",2]
[null,null,null,null,null,null,null,null,null,null,null,null,null,"Indiana","Huntington County",2]
[null,null,null,null,null,null,null,null,null,null,null,null,null,"Indiana","Jackson County",2]
[null,null,null,null,null,null,null,null,null,null,null,null,null,"Indiana","Jasper County",2]
[null,null,null,null,null,null,null,null,null,null,null,null,null,"Indiana","Jay County",2]
[null,null,null,null,null,null,null,null,null,null,null,null,null,"Indiana","Jefferson County",2]
[null,null,null,null,null,null,null,null,null,null,null,null,null,"Indiana","Jennings County",2]
[null,null,null,null,null,null,null,null,null,null,null,null,null,"Indiana","Johnson County",2]
[null,null,null,null,null,null,null,null,null,null,null,null,null,"Indiana","Knox County",2]
[null,null,null,null,null,null,null,null,null,null,null,null,null,"Indiana","Kosciusko County",2]
[null,null,null,null,null,null,null,null,null,null,null,null,null,"Indiana","LaGrange County",2]
[null,null,null,null,null,null,null,null,null,null,null,null,null,"Indiana","Lake County",2]
[null,null,null,null,null,null,null,null,null,null,null,null,null,"Indiana","LaPorte County",2]
[null,null,null,null,null,null,null,null,null,null,null,null,null,"Indiana","Lawrence County",2]
[null,null,null,null,null,null,null,null,null,null,null,null,null,"Indiana","Madison County",2]
[null,null,null,null,null,null,null,null,null,null,null,null,null,"Indiana","Marion County",2]
[null,null,null,null,null,null,null,null,null,null,null,null,null,"Indiana","Marshall County",2]
[null,null,null,null,null,null,null,null,null,null,null,null,null,"Indiana","Martin County","Not Eligible for Credit"]
[null,null,null,null,null,null,null,null,null,null,null,null,null,"Indiana","Miami County",2]
[null,null,null,null,null,null,null,null,null,null,null,null,null,"Indiana","Monroe County",2]
[null,null,null,null,null,null,null,null,null,null,null,null,null,"Indiana","Montgomery County",2]
[null,null,null,null,null,null,null,null,null,null,null,null,null,"Indiana","Morgan County",2]
[null,null,null,null,null,null,null,null,null,null,null,null,null,"Indiana","Newton County",2]
[null,null,null,null,null,null,null,null,null,null,null,null,null,"Indiana","Noble County",2]
[null,null,null,null,null,null,null,null,null,null,null,null,null,"Indiana","Ohio County",2]
[null,null,null,null,null,null,null,null,null,null,null,null,null,"Indiana","Orange County",2]
[null,null,null,null,null,null,null,null,null,null,null,null,null,"Indiana","Owen County",2]
[null,null,null,null,null,null,null,null,null,null,null,null,null,"Indiana","Parke County",2]
[null,null,null,null,null,null,null,null,null,null,null,null,null,"Indiana","Perry County",2]
[null,null,null,null,null,null,null,null,null,null,null,null,null,"Indiana","Pike County",2]
[null,null,null,null,null,null,null,null,null,null,null,null,null,"Indiana","Porter County",2]
[null,null,null,null,null,null,null,null,null,null,null,null,null,"Indiana","Posey County",2]
[null,null,null,null,null,null,null,null,null,null,null,null,null,"Indiana","Pulaski County",2]
[null,null,null,null,null,null,null,null,null,null,null,null,null,"Indiana","Putnam County",2]
[null,null,null,null,null,null,null,null,null,null,null,null,null,"Indiana","Randolph County",2]
[null,null,null,null,null,null,null,null,null,null,null,null,null,"Indiana","Ripley County",2]
[null,null,null,null,null,null,null,null,null,null,null,null,null,"Indiana","Rush County",2]
[null,null,null,null,null,null,null,null,null,null,null,null,null,"Indiana","Scott County",2]
[null,null,null,null,null,null,null,null,null,null,null,null,null,"Indiana","Shelby County",3]
[null,null,null,null,null,null,null,null,null,null,null,null,null,"Indiana","Spencer County",2]
[null,null,null,null,null,null,null,null,null,null,null,null,null,"Indiana","St. Joseph County",2]
[null,null,null,null,null,null,null,null,null,null,null,null,null,"Indiana","Starke County",3]
[null,null,null,null,null,null,null,null,null,null,null,null,null,"Indiana","Steuben County",2]
[null,null,null,null,null,null,null,null,null,null,null,null,null,"Indiana","Sullivan County",2]
[null,null,null,null,null,null,null,null,null,null,null,null,null,"Indiana","Switzerland County",2]
[null,null,null,null,null,null,null,null,null,null,null,null,null,"Indiana","Tippecanoe County",3]
[null,null,null,null,null,null,null,null,null,null,null,null,null,"Indiana","Tipton County",3]
[null,null,null,null,null,null,null,null,null,null,null,null,null,"Indiana","Union County",2]
[null,null,null,null,null,null,null,null,null,null,null,null,null,"Indiana","Vanderburgh County",2]
[null,null,null,null,null,null,null,null,null,null,null,null,null,"Indiana","Vermillion County",2]
[null,null,null,null,null,null,null,null,null,null,null,null,null,"Indiana","Vigo County",2]
[null,null,null,null,null,null,null,null,null,null,null,null,null,"Indiana","Wabash County",2]
[null,null,null,null,null,null,null,null,null,null,null,null,null,"Indiana","Warren County",2]
[null,null,null,null,null,null,null,null,null,null,null,null,null,"Indiana","Warrick County",2]
[null,null,null,null,null,null,null,null,null,null,null,null,null,"Indiana","Washington County",2]
[null,null,null,null,null,null,null,null,null,null,null,null,null,"Indiana","Wayne County",2]
[null,null,null,null,null,null,null,null,null,null,null,null,null,"Indiana","Wells County",2]
[null,null,null,null,null,null,null,null,null,null,null,null,null,"Indiana","White County",3]
[null,null,null,null,null,null,null,null,null,null,null,null,null,"Indiana","Whitley County",2]
[null,null,null,null,null,null,null,null,null,null,null,null,null,"Iowa","Adair County","Not Eligible for Credit"]
[null,null,null,null,null,null,null,null,null,null,null,null,null,"Iowa","Adams County","Not Eligible for Credit"]
[null,null,null,null,null,null,null,null,null,null,null,null,null,"Iowa","Allamakee County",2]
[null,null,null,null,null,null,null,null,null,null,null,null,null,"Iowa","Appanoose County","Not Eligible for Credit"]
[null,null,null,null,null,null,null,null,null,null,null,null,null,"Iowa","Audubon County","Not Eligible for Credit"]
[null,null,null,null,null,null,null,null,null,null,null,null,null,"Iowa","Benton County",2]
[null,null,null,null,null,null,null,null,null,null,null,null,null,"Iowa","Black Hawk County",2]
[null,null,null,null,null,null,null,null,null,null,null,null,null,"Iowa","Boone County",2]
[null,null,null,null,null,null,null,null,null,null,null,null,null,"Iowa","Bremer County",2]
[null,null,null,null,null,null,null,null,null,null,null,null,null,"Iowa","Buchanan County",2]
[null,null,null,null,null,null,null,null,null,null,null,null,null,"Iowa","Buena Vista County",2]
[null,null,null,null,null,null,null,null,null,null,null,null,null,"Iowa","Butler County",2]
[null,null,null,null,null,null,null,null,null,null,null,null,null,"Iowa","Calhoun County",2]
[null,null,null,null,null,null,null,null,null,null,null,null,null,"Iowa","Carroll County","Not Eligible for Credit"]
[null,null,null,null,null,null,null,null,null,null,null,null,null,"Iowa","Cass County","Not Eligible for Credit"]
[null,null,null,null,null,null,null,null,null,null,null,null,null,"Iowa","Cedar County",2]
[null,null,null,null,null,null,null,null,null,null,null,null,null,"Iowa","Cerro Gordo County","Not Eligible for Credit"]
[null,null,null,null,null,null,null,null,null,null,null,null,null,"Iowa","Cherokee County",2]
[null,null,null,null,null,null,null,null,null,null,null,null,null,"Iowa","Chickasaw County","Not Eligible for Credit"]
[null,null,null,null,null,null,null,null,null,null,null,null,null,"Iowa","Clarke County","Not Eligible for Credit"]
[null,null,null,null,null,null,null,null,null,null,null,null,null,"Iowa","Clay County",2]
[null,null,null,null,null,null,null,null,null,null,null,null,null,"Iowa","Clayton County",2]
[null,null,null,null,null,null,null,null,null,null,null,null,null,"Iowa","Clinton County",2]
[null,null,null,null,null,null,null,null,null,null,null,null,null,"Iowa","Crawford County",2]
[null,null,null,null,null,null,null,null,null,null,null,null,null,"Iowa","Dallas County","Not Eligible for Credit"]
[null,null,null,null,null,null,null,null,null,null,null,null,null,"Iowa","Davis County","Not Eligible for Credit"]
[null,null,null,null,null,null,null,null,null,null,null,null,null,"Iowa","Decatur County","Not Eligible for Credit"]
[null,null,null,null,null,null,null,null,null,null,null,null,null,"Iowa","Delaware County",2]
[null,null,null,null,null,null,null,null,null,null,null,null,null,"Iowa","Des Moines County",2]
[null,null,null,null,null,null,null,null,null,null,null,null,null,"Iowa","Dickinson County",2]
[null,null,null,null,null,null,null,null,null,null,null,null,null,"Iowa","Dubuque County",2]
[null,null,null,null,null,null,null,null,null,null,null,null,null,"Iowa","Emmet County",2]
[null,null,null,null,null,null,null,null,null,null,null,null,null,"Iowa","Fayette County",2]
[null,null,null,null,null,null,null,null,null,null,null,null,null,"Iowa","Floyd County","Not Eligible for Credit"]
[null,null,null,null,null,null,null,null,null,null,null,null,null,"Iowa","Franklin County","Not Eligible for Credit"]
[null,null,null,null,null,null,null,null,null,null,null,null,null,"Iowa","Fremont County","Not Eligible for Credit"]
[null,null,null,null,null,null,null,null,null,null,null,null,null,"Iowa","Greene County",2]
[null,null,null,null,null,null,null,null,null,null,null,null,null,"Iowa","Grundy County",2]
[null,null,null,null,null,null,null,null,null,null,null,null,null,"Iowa","Guthrie County","Not Eligible for Credit"]
[null,null,null,null,null,null,null,null,null,null,null,null,null,"Iowa","Hamilton County",2]
[null,null,null,null,null,null,null,null,null,null,null,null,null,"Iowa","Hancock County","Not Eligible for Credit"]
[null,null,null,null,null,null,null,null,null,null,null,null,null,"Iowa","Hardin County",2]
[null,null,null,null,null,null,null,null,null,null,null,null,null,"Iowa","Harrison County","Not Eligible for Credit"]
[null,null,null,null,null,null,null,null,null,null,null,null,null,"Iowa","Henry County",2]
[null,null,null,null,null,null,null,null,null,null,null,null,null,"Iowa","Howard County",2]
[null,null,null,null,null,null,null,null,null,null,null,null,null,"Iowa","Humboldt County",2]
[null,null,null,null,null,null,null,null,null,null,null,null,null,"Iowa","Ida County",2]
[null,null,null,null,null,null,null,null,null,null,null,null,null,"Iowa","Iowa County","Not Eligible for Credit"]
[null,null,null,null,null,null,null,null,null,null,null,null,null,"Iowa","Jackson County",2]
[null,null,null,null,null,null,null,null,null,null,null,null,null,"Iowa","Jasper County","Not Eligible for Credit"]
[null,null,null,null,null,null,null,null,null,null,null,null,null,"Iowa","Jefferson County",2]
[null,null,null,null,null,null,null,null,null,null,null,null,null,"Iowa","Johnson County",2]
[null,null,null,null,null,null,null,null,null,null,null,null,null,"Iowa","Jones County",2]
[null,null,null,null,null,null,null,null,null,null,null,null,null,"Iowa","Keokuk County","Not Eligible for Credit"]
[null,null,null,null,null,null,null,null,null,null,null,null,null,"Iowa","Kossuth County",2]
[null,null,null,null,null,null,null,null,null,null,null,null,null,"Iowa","Lee County","Not Eligible for Credit"]
[null,null,null,null,null,null,null,null,null,null,null,null,null,"Iowa","Linn County",2]
[null,null,null,null,null,null,null,null,null,null,null,null,null,"Iowa","Louisa County",2]
[null,null,null,null,null,null,null,null,null,null,null,null,null,"Iowa","Lucas County","Not Eligible for Credit"]
[null,null,null,null,null,null,null,null,null,null,null,null,null,"Iowa","Lyon County",2]
[null,null,null,null,null,null,null,null,null,null,null,null,null,"Iowa","Madison County","Not Eligible for Credit"]
[null,null,null,null,null,null,null,null,null,null,null,null,null,"Iowa","Mahaska County","Not Eligible for Credit"]
[null,null,null,null,null,null,null,null,null,null,null,null,null,"Iowa","Marion County","Not Eligible for Credit"]
[null,null,null,null,null,null,null,null,null,null,null,null,null,"Iowa","Marshall County",2]
[null,null,null,null,null,null,null,null,null,null,null,null,null,"Iowa","Mills County","Not Eligible for Credit"]
[null,null,null,null,null,null,null,null,null,null,null,null,null,"Iowa","Mitchell County",2]
[null,null,null,null,null,null,null,null,null,null,null,null,null,"Iowa","Monona County","Not Eligible for Credit"]
[null,null,null,null,null,null,null,null,null,null,null,null,null,"Iowa","Monroe County",2]
[null,null,null,null,null,null,null,null,null,null,null,null,null,"Iowa","Montgomery County","Not Eligible for Credit"]
[null,null,null,null,null,null,null,null,null,null,null,null,null,"Iowa","Muscatine County","Not Eligible for Credit"]
[null,null,null,null,null,null,null,null,null,null,null,null,null,"Iowa","O'Brien County",2]
[null,null,null,null,null,null,null,null,null,null,null,null,null,"Iowa","Osceola County",2]
[null,null,null,null,null,null,null,null,null,null,null,null,null,"Iowa","Page County","Not Eligible for Credit"]
[null,null,null,null,null,null,null,null,null,null,null,null,null,"Iowa","Palo Alto County",2]
[null,null,null,null,null,null,null,null,null,null,null,null,null,"Iowa","Plymouth County",2]
[null,null,null,null,null,null,null,null,null,null,null,null,null,"Iowa","Pocahontas County",2]
[null,null,null,null,null,null,null,null,null,null,null,null,null,"Iowa","Polk County",2]
[null,null,null,null,null,null,null,null,null,null,null,null,null,"Iowa","Pottawattamie County","Not Eligible for Credit"]
[null,null,null,null,null,null,null,null,null,null,null,null,null,"Iowa","Poweshiek County","Not Eligible for Credit"]
[null,null,null,null,null,null,null,null,null,null,null,null,null,"Iowa","Ringgold County","Not Eligible for Credit"]
[null,null,null,null,null,null,null,null,null,null,null,null,null,"Iowa","Sac County",2]
[null,null,null,null,null,null,null,null,null,null,null,null,null,"Iowa","Scott County",2]
[null,null,null,null,null,null,null,null,null,null,null,null,null,"Iowa","Shelby County","Not Eligible for Credit"]
[null,null,null,null,null,null,null,null,null,null,null,null,null,"Iowa","Sioux County",2]
[null,null,null,null,null,null,null,null,null,null,null,null,null,"Iowa","Story County",2]
[null,null,null,null,null,null,null,null,null,null,null,null,null,"Iowa","Tama County",2]
[null,null,null,null,null,null,null,null,null,null,null,null,null,"Iowa","Taylor County","Not Eligible for Credit"]
[null,null,null,null,null,null,null,null,null,null,null,null,null,"Iowa","Union County","Not Eligible for Credit"]
[null,null,null,null,null,null,null,null,null,null,null,null,null,"Iowa","Van Buren County","Not Eligible for Credit"]
[null,null,null,null,null,null,null,null,null,null,null,null,null,"Iowa","Wapello County",2]
[null,null,null,null,null,null,null,null,null,null,null,null,null,"Iowa","Warren County","Not Eligible for Credit"]
[null,null,null,null,null,null,null,null,null,null,null,null,null,"Iowa","Washington County","Not Eligible for Credit"]
[null,null,null,null,null,null,null,null,null,null,null,null,null,"Iowa","Wayne County","Not Eligible for Credit"]
[null,null,null,null,null,null,null,null,null,null,null,null,null,"Iowa","Webster County",2]
[null,null,null,null,null,null,null,null,null,null,null,null,null,"Iowa","Winnebago County","Not Eligible for Credit"]
[null,null,null,null,null,null,null,null,null,null,null,null,null,"Iowa","Winneshiek County",2]
[null,null,null,null,null,null,null,null,null,null,null,null,null,"Iowa","Woodbury County",2]
[null,null,null,null,null,null,null,null,null,null,null,null,null,"Iowa","Worth County",2]
[null,null,null,null,null,null,null,null,null,null,null,null,null,"Iowa","Wright County",2]
[null,null,null,null,null,null,null,null,null,null,null,null,null,"Kansas","Allen County","Not Eligible for Credit"]
[null,null,null,null,null,null,null,null,null,null,null,null,null,"Kansas","Anderson County","Not Eligible for Credit"]
[null,null,null,null,null,null,null,null,null,null,null,null,null,"Kansas","Atchison County","Not Eligible for Credit"]
[null,null,null,null,null,null,null,null,null,null,null,null,null,"Kansas","Barber County",2]
[null,null,null,null,null,null,null,null,null,null,null,null,null,"Kansas","Barton County",2]
[null,null,null,null,null,null,null,null,null,null,null,null,null,"Kansas","Bourbon County","Not Eligible for Credit"]
[null,null,null,null,null,null,null,null,null,null,null,null,null,"Kansas","Brown County","Not Eligible for Credit"]
[null,null,null,null,null,null,null,null,null,null,null,null,null,"Kansas","Butler County","Not Eligible for Credit"]
[null,null,null,null,null,null,null,null,null,null,null,null,null,"Kansas","Chase County","Not Eligible for Credit"]
[null,null,null,null,null,null,null,null,null,null,null,null,null,"Kansas","Chautauqua County","Not Eligible for Credit"]
[null,null,null,null,null,null,null,null,null,null,null,null,null,"Kansas","Cherokee County","Not Eligible for Credit"]
[null,null,null,null,null,null,null,null,null,null,null,null,null,"Kansas","Cheyenne County",3]
[null,null,null,null,null,null,null,null,null,null,null,null,null,"Kansas","Clark County",3]
[null,null,null,null,null,null,null,null,null,null,null,null,null,"Kansas","Clay County","Not Eligible for Credit"]
[null,null,null,null,null,null,null,null,null,null,null,null,null,"Kansas","Cloud County",2]
[null,null,null,null,null,null,null,null,null,null,null,null,null,"Kansas","Coffey County","Not Eligible for Credit"]
[null,null,null,null,null,null,null,null,null,null,null,null,null,"Kansas","Comanche County",2]
[null,null,null,null,null,null,null,null,null,null,null,null,null,"Kansas","Cowley County","Not Eligible for Credit"]
[null,null,null,null,null,null,null,null,null,null,null,null,null,"Kansas","Crawford County","Not Eligible for Credit"]
[null,null,null,null,null,null,null,null,null,null,null,null,null,"Kansas","Decatur County",2]
[null,null,null,null,null,null,null,null,null,null,null,null,null,"Kansas","Dickinson County","Not Eligible for Credit"]
[null,null,null,null,null,null,null,null,null,null,null,null,null,"Kansas","Doniphan County","Not Eligible for Credit"]
[null,null,null,null,null,null,null,null,null,null,null,null,null,"Kansas","Douglas County","Not Eligible for Credit"]
[null,null,null,null,null,null,null,null,null,null,null,null,null,"Kansas","Edwards County",2]
[null,null,null,null,null,null,null,null,null,null,null,null,null,"Kansas","Elk County","Not Eligible for Credit"]
[null,null,null,null,null,null,null,null,null,null,null,null,null,"Kansas","Ellis County",2]
[null,null,null,null,null,null,null,null,null,null,null,null,null,"Kansas","Ellsworth County",2]
[null,null,null,null,null,null,null,null,null,null,null,null,null,"Kansas","Finney County",3]
[null,null,null,null,null,null,null,null,null,null,null,null,null,"Kansas","Ford County",3]
[null,null,null,null,null,null,null,null,null,null,null,null,null,"Kansas","Franklin County","Not Eligible for Credit"]
[null,null,null,null,null,null,null,null,null,null,null,null,null,"Kansas","Geary County","Not Eligible for Credit"]
[null,null,null,null,null,null,null,null,null,null,null,null,null,"Kansas","Gove County",3]
[null,null,null,null,null,null,null,null,null,null,null,null,null,"Kansas","Graham County",3]
[null,null,null,null,null,null,null,null,null,null,null,null,null,"Kansas","Grant County",3]
[null,null,null,null,null,null,null,null,null,null,null,null,null,"Kansas","Gray County",2]
[null,null,null,null,null,null,null,null,null,null,null,null,null,"Kansas","Greeley County",3]
[null,null,null,null,null,null,null,null,null,null,null,null,null,"Kansas","Greenwood County","Not Eligible for Credit"]
[null,null,null,null,null,null,null,null,null,null,null,null,null,"Kansas","Hamilton County",3]
[null,null,null,null,null,null,null,null,null,null,null,null,null,"Kansas","Harper County",2]
[null,null,null,null,null,null,null,null,null,null,null,null,null,"Kansas","Harvey County","Not Eligible for Credit"]
[null,null,null,null,null,null,null,null,null,null,null,null,null,"Kansas","Haskell County",3]
[null,null,null,null,null,null,null,null,null,null,null,null,null,"Kansas","Hodgeman County",2]
[null,null,null,null,null,null,null,null,null,null,null,null,null,"Kansas","Jackson County","Not Eligible for Credit"]
[null,null,null,null,null,null,null,null,null,null,null,null,null,"Kansas","Jefferson County","Not Eligible for Credit"]
[null,null,null,null,null,null,null,null,null,null,null,null,null,"Kansas","Jewell County",2]
[null,null,null,null,null,null,null,null,null,null,null,null,null,"Kansas","Johnson County","Not Eligible for Credit"]
[null,null,null,null,null,null,null,null,null,null,null,null,null,"Kansas","Kearny County",3]
[null,null,null,null,null,null,null,null,null,null,null,null,null,"Kansas","Kingman County",2]
[null,null,null,null,null,null,null,null,null,null,null,null,null,"Kansas","Kiowa County",2]
[null,null,null,null,null,null,null,null,null,null,null,null,null,"Kansas","Labette County","Not Eligible for Credit"]
[null,null,null,null,null,null,null,null,null,null,null,null,null,"Kansas","Lane County",3]
[null,null,null,null,null,null,null,null,null,null,null,null,null,"Kansas","Leavenworth County","Not Eligible for Credit"]
[null,null,null,null,null,null,null,null,null,null,null,null,null,"Kansas","Lincoln County",2]
[null,null,null,null,null,null,null,null,null,null,null,null,null,"Kansas","Linn County","Not Eligible for Credit"]
[null,null,null,null,null,null,null,null,null,null,null,null,null,"Kansas","Logan County",3]
[null,null,null,null,null,null,null,null,null,null,null,null,null,"Kansas","Lyon County","Not Eligible for Credit"]
[null,null,null,null,null,null,null,null,null,null,null,null,null,"Kansas","Marion County","Not Eligible for Credit"]
[null,null,null,null,null,null,null,null,null,null,null,null,null,"Kansas","Marshall County","Not Eligible for Credit"]
[null,null,null,null,null,null,null,null,null,null,null,null,null,"Kansas","McPherson County","Not Eligible for Credit"]
[null,null,null,null,null,null,null,null,null,null,null,null,null,"Kansas","Meade County",3]
[null,null,null,null,null,null,null,null,null,null,null,null,null,"Kansas","Miami County","Not Eligible for Credit"]
[null,null,null,null,null,null,null,null,null,null,null,null,null,"Kansas","Mitchell County",2]
[null,null,null,null,null,null,null,null,null,null,null,null,null,"Kansas","Montgomery County","Not Eligible for Credit"]
[null,null,null,null,null,null,null,null,null,null,null,null,null,"Kansas","Morris County","Not Eligible for Credit"]
[null,null,null,null,null,null,null,null,null,null,null,null,null,"Kansas","Morton County",3]
[null,null,null,null,null,null,null,null,null,null,null,null,null,"Kansas","Nemaha County","Not Eligible for Credit"]
[null,null,null,null,null,null,null,null,null,null,null,null,null,"Kansas","Neosho County","Not Eligible for Credit"]
[null,null,null,null,null,null,null,null,null,null,null,null,null,"Kansas","Ness County",3]
[null,null,null,null,null,null,null,null,null,null,null,null,null,"Kansas","Norton County",3]
[null,null,null,null,null,null,null,null,null,null,null,null,null,"Kansas","Osage County","Not Eligible for Credit"]
[null,null,null,null,null,null,null,null,null,null,null,null,null,"Kansas","Osborne County",2]
[null,null,null,null,null,null,null,null,null,null,null,null,null,"Kansas","Ottawa County",2]
[null,null,null,null,null,null,null,null,null,null,null,null,null,"Kansas","Pawnee County",2]
[null,null,null,null,null,null,null,null,null,null,null,null,null,"Kansas","Phillips County",2]
[null,null,null,null,null,null,null,null,null,null,null,null,null,"Kansas","Pottawatomie County","Not Eligible for Credit"]
[null,null,null,null,null,null,null,null,null,null,null,null,null,"Kansas","Pratt County",2]
[null,null,null,null,null,null,null,null,null,null,null,null,null,"Kansas","Rawlins County",3]
[null,null,null,null,null,null,null,null,null,null,null,null,null,"Kansas","Reno County",2]
[null,null,null,null,null,null,null,null,null,null,null,null,null,"Kansas","Republic County",2]
[null,null,null,null,null,null,null,null,null,null,null,null,null,"Kansas","Rice County",2]
[null,null,null,null,null,null,null,null,null,null,null,null,null,"Kansas","Riley County","Not Eligible for Credit"]
[null,null,null,null,null,null,null,null,null,null,null,null,null,"Kansas","Rooks County",2]
[null,null,null,null,null,null,null,null,null,null,null,null,null,"Kansas","Rush County",2]
[null,null,null,null,null,null,null,null,null,null,null,null,null,"Kansas","Russell County",2]
[null,null,null,null,null,null,null,null,null,null,null,null,null,"Kansas","Saline County",2]
[null,null,null,null,null,null,null,null,null,null,null,null,null,"Kansas","Scott County",3]
[null,null,null,null,null,null,null,null,null,null,null,null,null,"Kansas","Sedgwick County","Not Eligible for Credit"]
[null,null,null,null,null,null,null,null,null,null,null,null,null,"Kansas","Seward County",3]
[null,null,null,null,null,null,null,null,null,null,null,null,null,"Kansas","Shawnee County","Not Eligible for Credit"]
[null,null,null,null,null,null,null,null,null,null,null,null,null,"Kansas","Sheridan County",3]
[null,null,null,null,null,null,null,null,null,null,null,null,null,"Kansas","Sherman County",3]
[null,null,null,null,null,null,null,null,null,null,null,null,null,"Kansas","Smith County",2]
[null,null,null,null,null,null,null,null,null,null,null,null,null,"Kansas","Stafford County",2]
[null,null,null,null,null,null,null,null,null,null,null,null,null,"Kansas","Stanton County",3]
[null,null,null,null,null,null,null,null,null,null,null,null,null,"Kansas","Stevens County",3]
[null,null,null,null,null,null,null,null,null,null,null,null,null,"Kansas","Sumner County","Not Eligible for Credit"]
[null,null,null,null,null,null,null,null,null,null,null,null,null,"Kansas","Thomas County",3]
[null,null,null,null,null,null,null,null,null,null,null,null,null,"Kansas","Trego County",2]
[null,null,null,null,null,null,null,null,null,null,null,null,null,"Kansas","Wabaunsee County","Not Eligible for Credit"]
[null,null,null,null,null,null,null,null,null,null,null,null,null,"Kansas","Wallace County",3]
[null,null,null,null,null,null,null,null,null,null,null,null,null,"Kansas","Washington County","Not Eligible for Credit"]
[null,null,null,null,null,null,null,null,null,null,null,null,null,"Kansas","Wichita County",3]
[null,null,null,null,null,null,null,null,null,null,null,null,null,"Kansas","Wilson County","Not Eligible for Credit"]
[null,null,null,null,null,null,null,null,null,null,null,null,null,"Kansas","Woodson County","Not Eligible for Credit"]
[null,null,null,null,null,null,null,null,null,null,null,null,null,"Kansas","Wyandotte County","Not Eligible for Credit"]
[null,null,null,null,null,null,null,null,null,null,null,null,null,"Kentucky","Adair County","Not Eligible for Credit"]
[null,null,null,null,null,null,null,null,null,null,null,null,null,"Kentucky","Allen County",2]
[null,null,null,null,null,null,null,null,null,null,null,null,null,"Kentucky","Anderson County",2]
[null,null,null,null,null,null,null,null,null,null,null,null,null,"Kentucky","Ballard County","Not Eligible for Credit"]
[null,null,null,null,null,null,null,null,null,null,null,null,null,"Kentucky","Barren County","Not Eligible for Credit"]
[null,null,null,null,null,null,null,null,null,null,null,null,null,"Kentucky","Bath County","Not Eligible for Credit"]
[null,null,null,null,null,null,null,null,null,null,null,null,null,"Kentucky","Bell County",3]
[null,null,null,null,null,null,null,null,null,null,null,null,null,"Kentucky","Boone County",2]
[null,null,null,null,null,null,null,null,null,null,null,null,null,"Kentucky","Bourbon County",2]
[null,null,null,null,null,null,null,null,null,null,null,null,null,"Kentucky","Boyd County",3]
[null,null,null,null,null,null,null,null,null,null,null,null,null,"Kentucky","Boyle County","Not Eligible for Credit"]
[null,null,null,null,null,null,null,null,null,null,null,null,null,"Kentucky","Bracken County",2]
[null,null,null,null,null,null,null,null,null,null,null,null,null,"Kentucky","Breathitt County",3]
[null,null,null,null,null,null,null,null,null,null,null,null,null,"Kentucky","Breckinridge County",2]
[null,null,null,null,null,null,null,null,null,null,null,null,null,"Kentucky","Bullitt County","Not Eligible for Credit"]
[null,null,null,null,null,null,null,null,null,null,null,null,null,"Kentucky","Butler County",2]
[null,null,null,null,null,null,null,null,null,null,null,null,null,"Kentucky","Caldwell County",2]
[null,null,null,null,null,null,null,null,null,null,null,null,null,"Kentucky","Calloway County","Not Eligible for Credit"]
[null,null,null,null,null,null,null,null,null,null,null,null,null,"Kentucky","Campbell County",2]
[null,null,null,null,null,null,null,null,null,null,null,null,null,"Kentucky","Carlisle County","Not Eligible for Credit"]
[null,null,null,null,null,null,null,null,null,null,null,null,null,"Kentucky","Carroll County",2]
[null,null,null,null,null,null,null,null,null,null,null,null,null,"Kentucky","Carter County",2]
[null,null,null,null,null,null,null,null,null,null,null,null,null,"Kentucky","Casey County","Not Eligible for Credit"]
[null,null,null,null,null,null,null,null,null,null,null,null,null,"Kentucky","Christian County","Not Eligible for Credit"]
[null,null,null,null,null,null,null,null,null,null,null,null,null,"Kentucky","Clark County",2]
[null,null,null,null,null,null,null,null,null,null,null,null,null,"Kentucky","Clay County",3]
[null,null,null,null,null,null,null,null,null,null,null,null,null,"Kentucky","Clinton County","Not Eligible for Credit"]
[null,null,null,null,null,null,null,null,null,null,null,null,null,"Kentucky","Crittenden County","Not Eligible for Credit"]
[null,null,null,null,null,null,null,null,null,null,null,null,null,"Kentucky","Cumberland County",2]
[null,null,null,null,null,null,null,null,null,null,null,null,null,"Kentucky","Daviess County","Not Eligible for Credit"]
[null,null,null,null,null,null,null,null,null,null,null,null,null,"Kentucky","Edmonson County","Not Eligible for Credit"]
[null,null,null,null,null,null,null,null,null,null,null,null,null,"Kentucky","Elliott County",2]
[null,null,null,null,null,null,null,null,null,null,null,null,null,"Kentucky","Estill County",2]
[null,null,null,null,null,null,null,null,null,null,null,null,null,"Kentucky","Fayette County","Not Eligible for Credit"]
[null,null,null,null,null,null,null,null,null,null,null,null,null,"Kentucky","Fleming County",2]
[null,null,null,null,null,null,null,null,null,null,null,null,null,"Kentucky","Floyd County",3]
[null,null,null,null,null,null,null,null,null,null,null,null,null,"Kentucky","Franklin County",2]
[null,null,null,null,null,null,null,null,null,null,null,null,null,"Kentucky","Fulton County","Not Eligible for Credit"]
[null,null,null,null,null,null,null,null,null,null,null,null,null,"Kentucky","Gallatin County",2]
[null,null,null,null,null,null,null,null,null,null,null,null,null,"Kentucky","Garrard County",2]
[null,null,null,null,null,null,null,null,null,null,null,null,null,"Kentucky","Grant County",2]
[null,null,null,null,null,null,null,null,null,null,null,null,null,"Kentucky","Graves County","Not Eligible for Credit"]
[null,null,null,null,null,null,null,null,null,null,null,null,null,"Kentucky","Grayson County",2]
[null,null,null,null,null,null,null,null,null,null,null,null,null,"Kentucky","Green County","Not Eligible for Credit"]
[null,null,null,null,null,null,null,null,null,null,null,null,null,"Kentucky","Greenup County",2]
[null,null,null,null,null,null,null,null,null,null,null,null,null,"Kentucky","Hancock County",2]
[null,null,null,null,null,null,null,null,null,null,null,null,null,"Kentucky","Hardin County",2]
[null,null,null,null,null,null,null,null,null,null,null,null,null,"Kentucky","Harlan County",3]
[null,null,null,null,null,null,null,null,null,null,null,null,null,"Kentucky","Harrison County",2]
[null,null,null,null,null,null,null,null,null,null,null,null,null,"Kentucky","Hart County","Not Eligible for Credit"]
[null,null,null,null,null,null,null,null,null,null,null,null,null,"Kentucky","Henderson County",2]
[null,null,null,null,null,null,null,null,null,null,null,null,null,"Kentucky","Henry County",2]
[null,null,null,null,null,null,null,null,null,null,null,null,null,"Kentucky","Hickman County","Not Eligible for Credit"]
[null,null,null,null,null,null,null,null,null,null,null,null,null,"Kentucky","Hopkins County",2]
[null,null,null,null,null,null,null,null,null,null,null,null,null,"Kentucky","Jackson County",3]
[null,null,null,null,null,null,null,null,null,null,null,null,null,"Kentucky","Jefferson County",2]
[null,null,null,null,null,null,null,null,null,null,null,null,null,"Kentucky","Jessamine County","Not Eligible for Credit"]
[null,null,null,null,null,null,null,null,null,null,null,null,null,"Kentucky","Johnson County",3]
[null,null,null,null,null,null,null,null,null,null,null,null,null,"Kentucky","Kenton County",2]
[null,null,null,null,null,null,null,null,null,null,null,null,null,"Kentucky","Knott County",3]
[null,null,null,null,null,null,null,null,null,null,null,null,null,"Kentucky","Knox County",3]
[null,null,null,null,null,null,null,null,null,null,null,null,null,"Kentucky","Larue County","Not Eligible for Credit"]
[null,null,null,null,null,null,null,null,null,null,null,null,null,"Kentucky","Laurel County",2]
[null,null,null,null,null,null,null,null,null,null,null,null,null,"Kentucky","Lawrence County",2]
[null,null,null,null,null,null,null,null,null,null,null,null,null,"Kentucky","Lee County",3]
[null,null,null,null,null,null,null,null,null,null,null,null,null,"Kentucky","Leslie County",3]
[null,null,null,null,null,null,null,null,null,null,null,null,null,"Kentucky","Letcher County",3]
[null,null,null,null,null,null,null,null,null,null,null,null,null,"Kentucky","Lewis County",2]
[null,null,null,null,null,null,null,null,null,null,null,null,null,"Kentucky","Lincoln County",2]
[null,null,null,null,null,null,null,null,null,null,null,null,null,"Kentucky","Livingston County","Not Eligible for Credit"]
[null,null,null,null,null,null,null,null,null,null,null,null,null,"Kentucky","Logan County",2]
[null,null,null,null,null,null,null,null,null,null,null,null,null,"Kentucky","Lyon County","Not Eligible for Credit"]
[null,null,null,null,null,null,null,null,null,null,null,null,null,"Kentucky","Madison County",2]
[null,null,null,null,null,null,null,null,null,null,null,null,null,"Kentucky","Magoffin County",3]
[null,null,null,null,null,null,null,null,null,null,null,null,null,"Kentucky","Marion County","Not Eligible for Credit"]
[null,null,null,null,null,null,null,null,null,null,null,null,null,"Kentucky","Marshall County","Not Eligible for Credit"]
[null,null,null,null,null,null,null,null,null,null,null,null,null,"Kentucky","Martin County",3]
[null,null,null,null,null,null,null,null,null,null,null,null,null,"Kentucky","Mason County",2]
[null,null,null,null,null,null,null,null,null,null,null,null,null,"Kentucky","McCracken County",2]
[null,null,null,null,null,null,null,null,null,null,null,null,null,"Kentucky","McCreary County",2]
[null,null,null,null,null,null,null,null,null,null,null,null,null,"Kentucky","McLean County",2]
[null,null,null,null,null,null,null,null,null,null,null,null,null,"Kentucky","Meade County","Not Eligible for Credit"]
[null,null,null,null,null,null,null,null,null,null,null,null,null,"Kentucky","Menifee County","Not Eligible for Credit"]
[null,null,null,null,null,null,null,null,null,null,null,null,null,"Kentucky","Mercer County","Not Eligible for Credit"]
[null,null,null,null,null,null,null,null,null,null,null,null,null,"Kentucky","Metcalfe County","Not Eligible for Credit"]
[null,null,null,null,null,null,null,null,null,null,null,null,null,"Kentucky","Monroe County","Not Eligible for Credit"]
[null,null,null,null,null,null,null,null,null,null,null,null,null,"Kentucky","Montgomery County","Not Eligible for Credit"]
[null,null,null,null,null,null,null,null,null,null,null,null,null,"Kentucky","Morgan County",2]
[null,null,null,null,null,null,null,null,null,null,null,null,null,"Kentucky","Muhlenberg County","Not Eligible for Credit"]
[null,null,null,null,null,null,null,null,null,null,null,null,null,"Kentucky","Nelson County","Not Eligible for Credit"]
[null,null,null,null,null,null,null,null,null,null,null,null,null,"Kentucky","Nicholas County",2]
[null,null,null,null,null,null,null,null,null,null,null,null,null,"Kentucky","Ohio County",2]
[null,null,null,null,null,null,null,null,null,null,null,null,null,"Kentucky","Oldham County",2]
[null,null,null,null,null,null,null,null,null,null,null,null,null,"Kentucky","Owen County",2]
[null,null,null,null,null,null,null,null,null,null,null,null,null,"Kentucky","Owsley County",3]
[null,null,null,null,null,null,null,null,null,null,null,null,null,"Kentucky","Pendleton County",2]
[null,null,null,null,null,null,null,null,null,null,null,null,null,"Kentucky","Perry County",3]
[null,null,null,null,null,null,null,null,null,null,null,null,null,"Kentucky","Pike County",3]
[null,null,null,null,null,null,null,null,null,null,null,null,null,"Kentucky","Powell County","Not Eligible for Credit"]
[null,null,null,null,null,null,null,null,null,null,null,null,null,"Kentucky","Pulaski County",2]
[null,null,null,null,null,null,null,null,null,null,null,null,null,"Kentucky","Robertson County",2]
[null,null,null,null,null,null,null,null,null,null,null,null,null,"Kentucky","Rockcastle County",2]
[null,null,null,null,null,null,null,null,null,null,null,null,null,"Kentucky","Rowan County",2]
[null,null,null,null,null,null,null,null,null,null,null,null,null,"Kentucky","Russell County",2]
[null,null,null,null,null,null,null,null,null,null,null,null,null,"Kentucky","Scott County",2]
[null,null,null,null,null,null,null,null,null,null,null,null,null,"Kentucky","Shelby County",2]
[null,null,null,null,null,null,null,null,null,null,null,null,null,"Kentucky","Simpson County","Not Eligible for Credit"]
[null,null,null,null,null,null,null,null,null,null,null,null,null,"Kentucky","Spencer County",2]
[null,null,null,null,null,null,null,null,null,null,null,null,null,"Kentucky","Taylor County","Not Eligible for Credit"]
[null,null,null,null,null,null,null,null,null,null,null,null,null,"Kentucky","Todd County","Not Eligible for Credit"]
[null,null,null,null,null,null,null,null,null,null,null,null,null,"Kentucky","Trigg County","Not Eligible for Credit"]
[null,null,null,null,null,null,null,null,null,null,null,null,null,"Kentucky","Trimble County",2]
[null,null,null,null,null,null,null,null,null,null,null,null,null,"Kentucky","Union County",2]
[null,null,null,null,null,null,null,null,null,null,null,null,null,"Kentucky","Warren County","Not Eligible for Credit"]
[null,null,null,null,null,null,null,null,null,null,null,null,null,"Kentucky","Washington County",2]
[null,null,null,null,null,null,null,null,null,null,null,null,null,"Kentucky","Wayne County",3]
[null,null,null,null,null,null,null,null,null,null,null,null,null,"Kentucky","Webster County","Not Eligible for Credit"]
[null,null,null,null,null,null,null,null,null,null,null,null,null,"Kentucky","Whitley County",2]
[null,null,null,null,null,null,null,null,null,null,null,null,null,"Kentucky","Wolfe County",2]
[null,null,null,null,null,null,null,null,null,null,null,null,null,"Kentucky","Woodford County",2]
[null,null,null,null,null,null,null,null,null,null,null,null,null,"Louisiana","Acadia Parish","Not Eligible for Credit"]
[null,null,null,null,null,null,null,null,null,null,null,null,null,"Louisiana","Allen Parish","Not Eligible for Credit"]
[null,null,null,null,null,null,null,null,null,null,null,null,null,"Louisiana","Ascension Parish","Not Eligible for Credit"]
[null,null,null,null,null,null,null,null,null,null,null,null,null,"Louisiana","Assumption Parish","Not Eligible for Credit"]
[null,null,null,null,null,null,null,null,null,null,null,null,null,"Louisiana","Avoyelles Parish","Not Eligible for Credit"]
[null,null,null,null,null,null,null,null,null,null,null,null,null,"Louisiana","Beauregard Parish","Not Eligible for Credit"]
[null,null,null,null,null,null,null,null,null,null,null,null,null,"Louisiana","Bienville Parish","Not Eligible for Credit"]
[null,null,null,null,null,null,null,null,null,null,null,null,null,"Louisiana","Bossier Parish","Not Eligible for Credit"]
[null,null,null,null,null,null,null,null,null,null,null,null,null,"Louisiana","Caddo Parish","Not Eligible for Credit"]
[null,null,null,null,null,null,null,null,null,null,null,null,null,"Louisiana","Calcasieu Parish","Not Eligible for Credit"]
[null,null,null,null,null,null,null,null,null,null,null,null,null,"Louisiana","Caldwell Parish","Not Eligible for Credit"]
[null,null,null,null,null,null,null,null,null,null,null,null,null,"Louisiana","Cameron Parish","Not Eligible for Credit"]
[null,null,null,null,null,null,null,null,null,null,null,null,null,"Louisiana","Catahoula Parish","Not Eligible for Credit"]
[null,null,null,null,null,null,null,null,null,null,null,null,null,"Louisiana","Claiborne Parish",2]
[null,null,null,null,null,null,null,null,null,null,null,null,null,"Louisiana","Concordia Parish","Not Eligible for Credit"]
[null,null,null,null,null,null,null,null,null,null,null,null,null,"Louisiana","De Soto Parish","Not Eligible for Credit"]
[null,null,null,null,null,null,null,null,null,null,null,null,null,"Louisiana","East Baton Rouge Parish","Not Eligible for Credit"]
[null,null,null,null,null,null,null,null,null,null,null,null,null,"Louisiana","East Carroll Parish","Not Eligible for Credit"]
[null,null,null,null,null,null,null,null,null,null,null,null,null,"Louisiana","East Feliciana Parish","Not Eligible for Credit"]
[null,null,null,null,null,null,null,null,null,null,null,null,null,"Louisiana","Evangeline Parish","Not Eligible for Credit"]
[null,null,null,null,null,null,null,null,null,null,null,null,null,"Louisiana","Franklin Parish","Not Eligible for Credit"]
[null,null,null,null,null,null,null,null,null,null,null,null,null,"Louisiana","Grant Parish","Not Eligible for Credit"]
[null,null,null,null,null,null,null,null,null,null,null,null,null,"Louisiana","Iberia Parish","Not Eligible for Credit"]
[null,null,null,null,null,null,null,null,null,null,null,null,null,"Louisiana","Iberville Parish","Not Eligible for Credit"]
[null,null,null,null,null,null,null,null,null,null,null,null,null,"Louisiana","Jackson Parish",2]
[null,null,null,null,null,null,null,null,null,null,null,null,null,"Louisiana","Jefferson Davis Parish","Not Eligible for Credit"]
[null,null,null,null,null,null,null,null,null,null,null,null,null,"Louisiana","Jefferson Parish","Not Eligible for Credit"]
[null,null,null,null,null,null,null,null,null,null,null,null,null,"Louisiana","Lafayette Parish","Not Eligible for Credit"]
[null,null,null,null,null,null,null,null,null,null,null,null,null,"Louisiana","Lafourche Parish","Not Eligible for Credit"]
[null,null,null,null,null,null,null,null,null,null,null,null,null,"Louisiana","LaSalle Parish","Not Eligible for Credit"]
[null,null,null,null,null,null,null,null,null,null,null,null,null,"Louisiana","Lincoln Parish",2]
[null,null,null,null,null,null,null,null,null,null,null,null,null,"Louisiana","Livingston Parish","Not Eligible for Credit"]
[null,null,null,null,null,null,null,null,null,null,null,null,null,"Louisiana","Madison Parish","Not Eligible for Credit"]
[null,null,null,null,null,null,null,null,null,null,null,null,null,"Louisiana","Morehouse Parish","Not Eligible for Credit"]
[null,null,null,null,null,null,null,null,null,null,null,null,null,"Louisiana","Natchitoches Parish","Not Eligible for Credit"]
[null,null,null,null,null,null,null,null,null,null,null,null,null,"Louisiana","Orleans Parish","Not Eligible for Credit"]
[null,null,null,null,null,null,null,null,null,null,null,null,null,"Louisiana","Ouachita Parish","Not Eligible for Credit"]
[null,null,null,null,null,null,null,null,null,null,null,null,null,"Louisiana","Plaquemines Parish","Not Eligible for Credit"]
[null,null,null,null,null,null,null,null,null,null,null,null,null,"Louisiana","Pointe Coupee Parish","Not Eligible for Credit"]
[null,null,null,null,null,null,null,null,null,null,null,null,null,"Louisiana","Rapides Parish","Not Eligible for Credit"]
[null,null,null,null,null,null,null,null,null,null,null,null,null,"Louisiana","Red River Parish","Not Eligible for Credit"]
[null,null,null,null,null,null,null,null,null,null,null,null,null,"Louisiana","Richland Parish","Not Eligible for Credit"]
[null,null,null,null,null,null,null,null,null,null,null,null,null,"Louisiana","Sabine Parish","Not Eligible for Credit"]
[null,null,null,null,null,null,null,null,null,null,null,null,null,"Louisiana","St. Bernard Parish","Not Eligible for Credit"]
[null,null,null,null,null,null,null,null,null,null,null,null,null,"Louisiana","St. Charles Parish","Not Eligible for Credit"]
[null,null,null,null,null,null,null,null,null,null,null,null,null,"Louisiana","St. Helena Parish","Not Eligible for Credit"]
[null,null,null,null,null,null,null,null,null,null,null,null,null,"Louisiana","St. James Parish","Not Eligible for Credit"]
[null,null,null,null,null,null,null,null,null,null,null,null,null,"Louisiana","St. John the Baptist Parish","Not Eligible for Credit"]
[null,null,null,null,null,null,null,null,null,null,null,null,null,"Louisiana","St. Landry Parish","Not Eligible for Credit"]
[null,null,null,null,null,null,null,null,null,null,null,null,null,"Louisiana","St. Martin Parish","Not Eligible for Credit"]
[null,null,null,null,null,null,null,null,null,null,null,null,null,"Louisiana","St. Mary Parish","Not Eligible for Credit"]
[null,null,null,null,null,null,null,null,null,null,null,null,null,"Louisiana","St. Tammany Parish","Not Eligible for Credit"]
[null,null,null,null,null,null,null,null,null,null,null,null,null,"Louisiana","Tangipahoa Parish","Not Eligible for Credit"]
[null,null,null,null,null,null,null,null,null,null,null,null,null,"Louisiana","Tensas Parish","Not Eligible for Credit"]
[null,null,null,null,null,null,null,null,null,null,null,null,null,"Louisiana","Terrebonne Parish","Not Eligible for Credit"]
[null,null,null,null,null,null,null,null,null,null,null,null,null,"Louisiana","Union Parish",2]
[null,null,null,null,null,null,null,null,null,null,null,null,null,"Louisiana","Vermilion Parish","Not Eligible for Credit"]
[null,null,null,null,null,null,null,null,null,null,null,null,null,"Louisiana","Vernon Parish","Not Eligible for Credit"]
[null,null,null,null,null,null,null,null,null,null,null,null,null,"Louisiana","Washington Parish","Not Eligible for Credit"]
[null,null,null,null,null,null,null,null,null,null,null,null,null,"Louisiana","Webster Parish","Not Eligible for Credit"]
[null,null,null,null,null,null,null,null,null,null,null,null,null,"Louisiana","West Baton Rouge Parish","Not Eligible for Credit"]
[null,null,null,null,null,null,null,null,null,null,null,null,null,"Louisiana","West Carroll Parish","Not Eligible for Credit"]
[null,null,null,null,null,null,null,null,null,null,null,null,null,"Louisiana","West Feliciana Parish","Not Eligible for Credit"]
[null,null,null,null,null,null,null,null,null,null,null,null,null,"Louisiana","Winn Parish",2]
[null,null,null,null,null,null,null,null,null,null,null,null,null,"Maine","Androscoggin County",2]
[null,null,null,null,null,null,null,null,null,null,null,null,null,"Maine","Aroostook County",2]
[null,null,null,null,null,null,null,null,null,null,null,null,null,"Maine","Cumberland County",2]
[null,null,null,null,null,null,null,null,null,null,null,null,null,"Maine","Franklin County",3]
[null,null,null,null,null,null,null,null,null,null,null,null,null,"Maine","Hancock County",2]
[null,null,null,null,null,null,null,null,null,null,null,null,null,"Maine","Kennebec County",2]
[null,null,null,null,null,null,null,null,null,null,null,null,null,"Maine","Knox County","Not Eligible for Credit"]
[null,null,null,null,null,null,null,null,null,null,null,null,null,"Maine","Lincoln County",2]
[null,null,null,null,null,null,null,null,null,null,null,null,null,"Maine","Oxford County",3]
[null,null,null,null,null,null,null,null,null,null,null,null,null,"Maine","Penobscot County",2]
[null,null,null,null,null,null,null,null,null,null,null,null,null,"Maine","Piscataquis County",2]
[null,null,null,null,null,null,null,null,null,null,null,null,null,"Maine","Sagadahoc County",2]
[null,null,null,null,null,null,null,null,null,null,null,null,null,"Maine","Somerset County",2]
[null,null,null,null,null,null,null,null,null,null,null,null,null,"Maine","Waldo County",2]
[null,null,null,null,null,null,null,null,null,null,null,null,null,"Maine","Washington County",2]
[null,null,null,null,null,null,null,null,null,null,null,null,null,"Maine","York County",2]
[null,null,null,null,null,null,null,null,null,null,null,null,null,"Maryland","Allegany County",2]
[null,null,null,null,null,null,null,null,null,null,null,null,null,"Maryland","Anne Arundel County","Not Eligible for Credit"]
[null,null,null,null,null,null,null,null,null,null,null,null,null,"Maryland","Baltimore City",2]
[null,null,null,null,null,null,null,null,null,null,null,null,null,"Maryland","Baltimore County",2]
[null,null,null,null,null,null,null,null,null,null,null,null,null,"Maryland","Calvert County",2]
[null,null,null,null,null,null,null,null,null,null,null,null,null,"Maryland","Caroline County","Not Eligible for Credit"]
[null,null,null,null,null,null,null,null,null,null,null,null,null,"Maryland","Carroll County",2]
[null,null,null,null,null,null,null,null,null,null,null,null,null,"Maryland","Cecil County","Not Eligible for Credit"]
[null,null,null,null,null,null,null,null,null,null,null,null,null,"Maryland","Charles County","Not Eligible for Credit"]
[null,null,null,null,null,null,null,null,null,null,null,null,null,"Maryland","Dorchester County","Not Eligible for Credit"]
[null,null,null,null,null,null,null,null,null,null,null,null,null,"Maryland","Frederick County",2]
[null,null,null,null,null,null,null,null,null,null,null,null,null,"Maryland","Garrett County",2]
[null,null,null,null,null,null,null,null,null,null,null,null,null,"Maryland","Harford County",2]
[null,null,null,null,null,null,null,null,null,null,null,null,null,"Maryland","Howard County",2]
[null,null,null,null,null,null,null,null,null,null,null,null,null,"Maryland","Kent County","Not Eligible for Credit"]
[null,null,null,null,null,null,null,null,null,null,null,null,null,"Maryland","Montgomery County",2]
[null,null,null,null,null,null,null,null,null,null,null,null,null,"Maryland","Prince George's County",2]
[null,null,null,null,null,null,null,null,null,null,null,null,null,"Maryland","Queen Anne's County","Not Eligible for Credit"]
[null,null,null,null,null,null,null,null,null,null,null,null,null,"Maryland","Somerset County","Not Eligible for Credit"]
[null,null,null,null,null,null,null,null,null,null,null,null,null,"Maryland","St. Mary's County","Not Eligible for Credit"]
[null,null,null,null,null,null,null,null,null,null,null,null,null,"Maryland","Talbot County","Not Eligible for Credit"]
[null,null,null,null,null,null,null,null,null,null,null,null,null,"Maryland","Washington County",2]
[null,null,null,null,null,null,null,null,null,null,null,null,null,"Maryland","Wicomico County","Not Eligible for Credit"]
[null,null,null,null,null,null,null,null,null,null,null,null,null,"Maryland","Worcester County","Not Eligible for Credit"]
[null,null,null,null,null,null,null,null,null,null,null,null,null,"Massachusetts","Barnstable County",2]
[null,null,null,null,null,null,null,null,null,null,null,null,null,"Massachusetts","Berkshire County",2]
[null,null,null,null,null,null,null,null,null,null,null,null,null,"Massachusetts","Bristol County","Not Eligible for Credit"]
[null,null,null,null,null,null,null,null,null,null,null,null,null,"Massachusetts","Dukes County",3]
[null,null,null,null,null,null,null,null,null,null,null,null,null,"Massachusetts","Essex County",2]
[null,null,null,null,null,null,null,null,null,null,null,null,null,"Massachusetts","Franklin County","Not Eligible for Credit"]
[null,null,null,null,null,null,null,null,null,null,null,null,null,"Massachusetts","Hampden County","Not Eligible for Credit"]
[null,null,null,null,null,null,null,null,null,null,null,null,null,"Massachusetts","Hampshire County","Not Eligible for Credit"]
[null,null,null,null,null,null,null,null,null,null,null,null,null,"Massachusetts","Middlesex County",3]
[null,null,null,null,null,null,null,null,null,null,null,null,null,"Massachusetts","Nantucket County",3]
[null,null,null,null,null,null,null,null,null,null,null,null,null,"Massachusetts","Norfolk County",2]
[null,null,null,null,null,null,null,null,null,null,null,null,null,"Massachusetts","Plymouth County",2]
[null,null,null,null,null,null,null,null,null,null,null,null,null,"Massachusetts","Suffolk County",2]
[null,null,null,null,null,null,null,null,null,null,null,null,null,"Massachusetts","Worcester County",2]
[null,null,null,null,null,null,null,null,null,null,null,null,null,"Michigan","Alcona County",2]
[null,null,null,null,null,null,null,null,null,null,null,null,null,"Michigan","Alger County",3]
[null,null,null,null,null,null,null,null,null,null,null,null,null,"Michigan","Allegan County",2]
[null,null,null,null,null,null,null,null,null,null,null,null,null,"Michigan","Alpena County",2]
[null,null,null,null,null,null,null,null,null,null,null,null,null,"Michigan","Antrim County",3]
[null,null,null,null,null,null,null,null,null,null,null,null,null,"Michigan","Arenac County",2]
[null,null,null,null,null,null,null,null,null,null,null,null,null,"Michigan","Baraga County",3]
[null,null,null,null,null,null,null,null,null,null,null,null,null,"Michigan","Barry County",2]
[null,null,null,null,null,null,null,null,null,null,null,null,null,"Michigan","Bay County",3]
[null,null,null,null,null,null,null,null,null,null,null,null,null,"Michigan","Benzie County",3]
[null,null,null,null,null,null,null,null,null,null,null,null,null,"Michigan","Berrien County",2]
[null,null,null,null,null,null,null,null,null,null,null,null,null,"Michigan","Branch County",2]
[null,null,null,null,null,null,null,null,null,null,null,null,null,"Michigan","Calhoun County",2]
[null,null,null,null,null,null,null,null,null,null,null,null,null,"Michigan","Cass County",3]
[null,null,null,null,null,null,null,null,null,null,null,null,null,"Michigan","Charlevoix County",3]
[null,null,null,null,null,null,null,null,null,null,null,null,null,"Michigan","Cheboygan County",3]
[null,null,null,null,null,null,null,null,null,null,null,null,null,"Michigan","Chippewa County",3]
[null,null,null,null,null,null,null,null,null,null,null,null,null,"Michigan","Clare County",3]
[null,null,null,null,null,null,null,null,null,null,null,null,null,"Michigan","Clinton County",3]
[null,null,null,null,null,null,null,null,null,null,null,null,null,"Michigan","Crawford County",3]
[null,null,null,null,null,null,null,null,null,null,null,null,null,"Michigan","Delta County",3]
[null,null,null,null,null,null,null,null,null,null,null,null,null,"Michigan","Dickinson County",3]
[null,null,null,null,null,null,null,null,null,null,null,null,null,"Michigan","Eaton County",3]
[null,null,null,null,null,null,null,null,null,null,null,null,null,"Michigan","Emmet County",3]
[null,null,null,null,null,null,null,null,null,null,null,null,null,"Michigan","Genesee County",3]
[null,null,null,null,null,null,null,null,null,null,null,null,null,"Michigan","Gladwin County",2]
[null,null,null,null,null,null,null,null,null,null,null,null,null,"Michigan","Gogebic County",2]
[null,null,null,null,null,null,null,null,null,null,null,null,null,"Michigan","Grand Traverse County",3]
[null,null,null,null,null,null,null,null,null,null,null,null,null,"Michigan","Gratiot County",2]
[null,null,null,null,null,null,null,null,null,null,null,null,null,"Michigan","Hillsdale County",2]
[null,null,null,null,null,null,null,null,null,null,null,null,null,"Michigan","Houghton County",2]
[null,null,null,null,null,null,null,null,null,null,null,null,null,"Michigan","Huron County",3]
[null,null,null,null,null,null,null,null,null,null,null,null,null,"Michigan","Ingham County",3]
[null,null,null,null,null,null,null,null,null,null,null,null,null,"Michigan","Ionia County",3]
[null,null,null,null,null,null,null,null,null,null,null,null,null,"Michigan","Iosco County",2]
[null,null,null,null,null,null,null,null,null,null,null,null,null,"Michigan","Iron County",3]
[null,null,null,null,null,null,null,null,null,null,null,null,null,"Michigan","Isabella County",2]
[null,null,null,null,null,null,null,null,null,null,null,null,null,"Michigan","Jackson County",3]
[null,null,null,null,null,null,null,null,null,null,null,null,null,"Michigan","Kalamazoo County",3]
[null,null,null,null,null,null,null,null,null,null,null,null,null,"Michigan","Kalkaska County",3]
[null,null,null,null,null,null,null,null,null,null,null,null,null,"Michigan","Kent County",2]
[null,null,null,null,null,null,null,null,null,null,null,null,null,"Michigan","Keweenaw County",3]
[null,null,null,null,null,null,null,null,null,null,null,null,null,"Michigan","Lake County",3]
[null,null,null,null,null,null,null,null,null,null,null,null,null,"Michigan","Lapeer County",3]
[null,null,null,null,null,null,null,null,null,null,null,null,null,"Michigan","Leelanau County",3]
[null,null,null,null,null,null,null,null,null,null,null,null,null,"Michigan","Lenawee County",2]
[null,null,null,null,null,null,null,null,null,null,null,null,null,"Michigan","Livingston County",3]
[null,null,null,null,null,null,null,null,null,null,null,null,null,"Michigan","Luce County",3]
[null,null,null,null,null,null,null,null,null,null,null,null,null,"Michigan","Mackinac County",3]
[null,null,null,null,null,null,null,null,null,null,null,null,null,"Michigan","Macomb County",3]
[null,null,null,null,null,null,null,null,null,null,null,null,null,"Michigan","Manistee County",3]
[null,null,null,null,null,null,null,null,null,null,null,null,null,"Michigan","Marquette County",3]
[null,null,null,null,null,null,null,null,null,null,null,null,null,"Michigan","Mason County",2]
[null,null,null,null,null,null,null,null,null,null,null,null,null,"Michigan","Mecosta County",3]
[null,null,null,null,null,null,null,null,null,null,null,null,null,"Michigan","Menominee County",3]
[null,null,null,null,null,null,null,null,null,null,null,null,null,"Michigan","Midland County",3]
[null,null,null,null,null,null,null,null,null,null,null,null,null,"Michigan","Missaukee County",3]
[null,null,null,null,null,null,null,null,null,null,null,null,null,"Michigan","Monroe County",2]
[null,null,null,null,null,null,null,null,null,null,null,null,null,"Michigan","Montcalm County",2]
[null,null,null,null,null,null,null,null,null,null,null,null,null,"Michigan","Montmorency County",3]
[null,null,null,null,null,null,null,null,null,null,null,null,null,"Michigan","Muskegon County",3]
[null,null,null,null,null,null,null,null,null,null,null,null,null,"Michigan","Newaygo County",3]
[null,null,null,null,null,null,null,null,null,null,null,null,null,"Michigan","Oakland County",3]
[null,null,null,null,null,null,null,null,null,null,null,null,null,"Michigan","Oceana County",2]
[null,null,null,null,null,null,null,null,null,null,null,null,null,"Michigan","Ogemaw County",2]
[null,null,null,null,null,null,null,null,null,null,null,null,null,"Michigan","Ontonagon County",2]
[null,null,null,null,null,null,null,null,null,null,null,null,null,"Michigan","Osceola County",2]
[null,null,null,null,null,null,null,null,null,null,null,null,null,"Michigan","Oscoda County",2]
[null,null,null,null,null,null,null,null,null,null,null,null,null,"Michigan","Otsego County",3]
[null,null,null,null,null,null,null,null,null,null,null,null,null,"Michigan","Ottawa County",2]
[null,null,null,null,null,null,null,null,null,null,null,null,null,"Michigan","Presque Isle County",3]
[null,null,null,null,null,null,null,null,null,null,null,null,null,"Michigan","Roscommon County",3]
[null,null,null,null,null,null,null,null,null,null,null,null,null,"Michigan","Saginaw County",3]
[null,null,null,null,null,null,null,null,null,null,null,null,null,"Michigan","Sanilac County",3]
[null,null,null,null,null,null,null,null,null,null,null,null,null,"Michigan","Schoolcraft County",3]
[null,null,null,null,null,null,null,null,null,null,null,null,null,"Michigan","Shiawassee County",2]
[null,null,null,null,null,null,null,null,null,null,null,null,null,"Michigan","St. Clair County",3]
[null,null,null,null,null,null,null,null,null,null,null,null,null,"Michigan","St. Joseph County",3]
[null,null,null,null,null,null,null,null,null,null,null,null,null,"Michigan","Tuscola County",3]
[null,null,null,null,null,null,null,null,null,null,null,null,null,"Michigan","Van Buren County",2]
[null,null,null,null,null,null,null,null,null,null,null,null,null,"Michigan","Washtenaw County",2]
[null,null,null,null,null,null,null,null,null,null,null,null,null,"Michigan","Wayne County",2]
[null,null,null,null,null,null,null,null,null,null,null,null,null,"Michigan","Wexford County",3]
[null,null,null,null,null,null,null,null,null,null,null,null,null,"Minnesota","Aitkin County",2]
[null,null,null,null,null,null,null,null,null,null,null,null,null,"Minnesota","Anoka County",3]
[null,null,null,null,null,null,null,null,null,null,null,null,null,"Minnesota","Becker County",2]
[null,null,null,null,null,null,null,null,null,null,null,null,null,"Minnesota","Beltrami County",2]
[null,null,null,null,null,null,null,null,null,null,null,null,null,"Minnesota","Benton County",2]
[null,null,null,null,null,null,null,null,null,null,null,null,null,"Minnesota","Big Stone County",2]
[null,null,null,null,null,null,null,null,null,null,null,null,null,"Minnesota","Blue Earth County","Not Eligible for Credit"]
[null,null,null,null,null,null,null,null,null,null,null,null,null,"Minnesota","Brown County","Not Eligible for Credit"]
[null,null,null,null,null,null,null,null,null,null,null,null,null,"Minnesota","Carlton County",2]
[null,null,null,null,null,null,null,null,null,null,null,null,null,"Minnesota","Carver County","Not Eligible for Credit"]
[null,null,null,null,null,null,null,null,null,null,null,null,null,"Minnesota","Cass County",2]
[null,null,null,null,null,null,null,null,null,null,null,null,null,"Minnesota","Chippewa County",2]
[null,null,null,null,null,null,null,null,null,null,null,null,null,"Minnesota","Chisago County",2]
[null,null,null,null,null,null,null,null,null,null,null,null,null,"Minnesota","Clay County",2]
[null,null,null,null,null,null,null,null,null,null,null,null,null,"Minnesota","Clearwater County",2]
[null,null,null,null,null,null,null,null,null,null,null,null,null,"Minnesota","Cook County",2]
[null,null,null,null,null,null,null,null,null,null,null,null,null,"Minnesota","Cottonwood County",2]
[null,null,null,null,null,null,null,null,null,null,null,null,null,"Minnesota","Crow Wing County",2]
[null,null,null,null,null,null,null,null,null,null,null,null,null,"Minnesota","Dakota County",2]
[null,null,null,null,null,null,null,null,null,null,null,null,null,"Minnesota","Dodge County",2]
[null,null,null,null,null,null,null,null,null,null,null,null,null,"Minnesota","Douglas County",2]
[null,null,null,null,null,null,null,null,null,null,null,null,null,"Minnesota","Faribault County","Not Eligible for Credit"]
[null,null,null,null,null,null,null,null,null,null,null,null,null,"Minnesota","Fillmore County",2]
[null,null,null,null,null,null,null,null,null,null,null,null,null,"Minnesota","Freeborn County","Not Eligible for Credit"]
[null,null,null,null,null,null,null,null,null,null,null,null,null,"Minnesota","Goodhue County",2]
[null,null,null,null,null,null,null,null,null,null,null,null,null,"Minnesota","Grant County",2]
[null,null,null,null,null,null,null,null,null,null,null,null,null,"Minnesota","Hennepin County",2]
[null,null,null,null,null,null,null,null,null,null,null,null,null,"Minnesota","Houston County",2]
[null,null,null,null,null,null,null,null,null,null,null,null,null,"Minnesota","Hubbard County",2]
[null,null,null,null,null,null,null,null,null,null,null,null,null,"Minnesota","Isanti County",2]
[null,null,null,null,null,null,null,null,null,null,null,null,null,"Minnesota","Itasca County",2]
[null,null,null,null,null,null,null,null,null,null,null,null,null,"Minnesota","Jackson County",2]
[null,null,null,null,null,null,null,null,null,null,null,null,null,"Minnesota","Kanabec County",2]
[null,null,null,null,null,null,null,null,null,null,null,null,null,"Minnesota","Kandiyohi County","Not Eligible for Credit"]
[null,null,null,null,null,null,null,null,null,null,null,null,null,"Minnesota","Kittson County",2]
[null,null,null,null,null,null,null,null,null,null,null,null,null,"Minnesota","Koochiching County",2]
[null,null,null,null,null,null,null,null,null,null,null,null,null,"Minnesota","Lac qui Parle County",2]
[null,null,null,null,null,null,null,null,null,null,null,null,null,"Minnesota","Lake County",3]
[null,null,null,null,null,null,null,null,null,null,null,null,null,"Minnesota","Lake of the Woods County",2]
[null,null,null,null,null,null,null,null,null,null,null,null,null,"Minnesota","Le Sueur County","Not Eligible for Credit"]
[null,null,null,null,null,null,null,null,null,null,null,null,null,"Minnesota","Lincoln County",2]
[null,null,null,null,null,null,null,null,null,null,null,null,null,"Minnesota","Lyon County",2]
[null,null,null,null,null,null,null,null,null,null,null,null,null,"Minnesota","Mahnomen County","Not Eligible for Credit"]
[null,null,null,null,null,null,null,null,null,null,null,null,null,"Minnesota","Marshall County",2]
[null,null,null,null,null,null,null,null,null,null,null,null,null,"Minnesota","Martin County","Not Eligible for Credit"]
[null,null,null,null,null,null,null,null,null,null,null,null,null,"Minnesota","McLeod County","Not Eligible for Credit"]
[null,null,null,null,null,null,null,null,null,null,null,null,null,"Minnesota","Meeker County","Not Eligible for Credit"]
[null,null,null,null,null,null,null,null,null,null,null,null,null,"Minnesota","Mille Lacs County",2]
[null,null,null,null,null,null,null,null,null,null,null,null,null,"Minnesota","Morrison County",2]
[null,null,null,null,null,null,null,null,null,null,null,null,null,"Minnesota","Mower County",2]
[null,null,null,null,null,null,null,null,null,null,null,null,null,"Minnesota","Murray County",2]
[null,null,null,null,null,null,null,null,null,null,null,null,null,"Minnesota","Nicollet County","Not Eligible for Credit"]
[null,null,null,null,null,null,null,null,null,null,null,null,null,"Minnesota","Nobles County",2]
[null,null,null,null,null,null,null,null,null,null,null,null,null,"Minnesota","Norman County",2]
[null,null,null,null,null,null,null,null,null,null,null,null,null,"Minnesota","Olmsted County",2]
[null,null,null,null,null,null,null,null,null,null,null,null,null,"Minnesota","Otter Tail County","Not Eligible for Credit"]
[null,null,null,null,null,null,null,null,null,null,null,null,null,"Minnesota","Pennington County",2]
[null,null,null,null,null,null,null,null,null,null,null,null,null,"Minnesota","Pine County",3]
[null,null,null,null,null,null,null,null,null,null,null,null,null,"Minnesota","Pipestone County",2]
[null,null,null,null,null,null,null,null,null,null,null,null,null,"Minnesota","Polk County",2]
[null,null,null,null,null,null,null,null,null,null,null,null,null,"Minnesota","Pope County",3]
[null,null,null,null,null,null,null,null,null,null,null,null,null,"Minnesota","Ramsey County",2]
[null,null,null,null,null,null,null,null,null,null,null,null,null,"Minnesota","Red Lake County",2]
[null,null,null,null,null,null,null,null,null,null,null,null,null,"Minnesota","Redwood County",2]
[null,null,null,null,null,null,null,null,null,null,null,null,null,"Minnesota","Renville County",2]
[null,null,null,null,null,null,null,null,null,null,null,null,null,"Minnesota","Rice County","Not Eligible for Credit"]
[null,null,null,null,null,null,null,null,null,null,null,null,null,"Minnesota","Rock County",2]
[null,null,null,null,null,null,null,null,null,null,null,null,null,"Minnesota","Roseau County",2]
[null,null,null,null,null,null,null,null,null,null,null,null,null,"Minnesota","Scott County","Not Eligible for Credit"]
[null,null,null,null,null,null,null,null,null,null,null,null,null,"Minnesota","Sherburne County",2]
[null,null,null,null,null,null,null,null,null,null,null,null,null,"Minnesota","Sibley County","Not Eligible for Credit"]
[null,null,null,null,null,null,null,null,null,null,null,null,null,"Minnesota","St. Louis County",2]
[null,null,null,null,null,null,null,null,null,null,null,null,null,"Minnesota","Stearns County",2]
[null,null,null,null,null,null,null,null,null,null,null,null,null,"Minnesota","Steele County","Not Eligible for Credit"]
[null,null,null,null,null,null,null,null,null,null,null,null,null,"Minnesota","Stevens County",2]
[null,null,null,null,null,null,null,null,null,null,null,null,null,"Minnesota","Swift County",2]
[null,null,null,null,null,null,null,null,null,null,null,null,null,"Minnesota","Todd County",2]
[null,null,null,null,null,null,null,null,null,null,null,null,null,"Minnesota","Traverse County",2]
[null,null,null,null,null,null,null,null,null,null,null,null,null,"Minnesota","Wabasha County",2]
[null,null,null,null,null,null,null,null,null,null,null,null,null,"Minnesota","Wadena County",2]
[null,null,null,null,null,null,null,null,null,null,null,null,null,"Minnesota","Waseca County","Not Eligible for Credit"]
[null,null,null,null,null,null,null,null,null,null,null,null,null,"Minnesota","Washington County",2]
[null,null,null,null,null,null,null,null,null,null,null,null,null,"Minnesota","Watonwan County",2]
[null,null,null,null,null,null,null,null,null,null,null,null,null,"Minnesota","Wilkin County",2]
[null,null,null,null,null,null,null,null,null,null,null,null,null,"Minnesota","Winona County",2]
[null,null,null,null,null,null,null,null,null,null,null,null,null,"Minnesota","Wright County","Not Eligible for Credit"]
[null,null,null,null,null,null,null,null,null,null,null,null,null,"Minnesota","Yellow Medicine County",2]
[null,null,null,null,null,null,null,null,null,null,null,null,null,"Mississippi","Adams County","Not Eligible for Credit"]
[null,null,null,null,null,null,null,null,null,null,null,null,null,"Mississippi","Alcorn County","Not Eligible for Credit"]
[null,null,null,null,null,null,null,null,null,null,null,null,null,"Mississippi","Amite County","Not Eligible for Credit"]
[null,null,null,null,null,null,null,null,null,null,null,null,null,"Mississippi","Attala County","Not Eligible for Credit"]
[null,null,null,null,null,null,null,null,null,null,null,null,null,"Mississippi","Benton County","Not Eligible for Credit"]
[null,null,null,null,null,null,null,null,null,null,null,null,null,"Mississippi","Bolivar County","Not Eligible for Credit"]
[null,null,null,null,null,null,null,null,null,null,null,null,null,"Mississippi","Calhoun County","Not Eligible for Credit"]
[null,null,null,null,null,null,null,null,null,null,null,null,null,"Mississippi","Carroll County","Not Eligible for Credit"]
[null,null,null,null,null,null,null,null,null,null,null,null,null,"Mississippi","Chickasaw County","Not Eligible for Credit"]
[null,null,null,null,null,null,null,null,null,null,null,null,null,"Mississippi","Choctaw County","Not Eligible for Credit"]
[null,null,null,null,null,null,null,null,null,null,null,null,null,"Mississippi","Claiborne County","Not Eligible for Credit"]
[null,null,null,null,null,null,null,null,null,null,null,null,null,"Mississippi","Clarke County",2]
[null,null,null,null,null,null,null,null,null,null,null,null,null,"Mississippi","Clay County","Not Eligible for Credit"]
[null,null,null,null,null,null,null,null,null,null,null,null,null,"Mississippi","Coahoma County","Not Eligible for Credit"]
[null,null,null,null,null,null,null,null,null,null,null,null,null,"Mississippi","Copiah County","Not Eligible for Credit"]
[null,null,null,null,null,null,null,null,null,null,null,null,null,"Mississippi","Covington County","Not Eligible for Credit"]
[null,null,null,null,null,null,null,null,null,null,null,null,null,"Mississippi","DeSoto County","Not Eligible for Credit"]
[null,null,null,null,null,null,null,null,null,null,null,null,null,"Mississippi","Forrest County","Not Eligible for Credit"]
[null,null,null,null,null,null,null,null,null,null,null,null,null,"Mississippi","Franklin County","Not Eligible for Credit"]
[null,null,null,null,null,null,null,null,null,null,null,null,null,"Mississippi","George County","Not Eligible for Credit"]
[null,null,null,null,null,null,null,null,null,null,null,null,null,"Mississippi","Greene County","Not Eligible for Credit"]
[null,null,null,null,null,null,null,null,null,null,null,null,null,"Mississippi","Grenada County","Not Eligible for Credit"]
[null,null,null,null,null,null,null,null,null,null,null,null,null,"Mississippi","Hancock County",2]
[null,null,null,null,null,null,null,null,null,null,null,null,null,"Mississippi","Harrison County",2]
[null,null,null,null,null,null,null,null,null,null,null,null,null,"Mississippi","Hinds County",2]
[null,null,null,null,null,null,null,null,null,null,null,null,null,"Mississippi","Holmes County","Not Eligible for Credit"]
[null,null,null,null,null,null,null,null,null,null,null,null,null,"Mississippi","Humphreys County","Not Eligible for Credit"]
[null,null,null,null,null,null,null,null,null,null,null,null,null,"Mississippi","Issaquena County","Not Eligible for Credit"]
[null,null,null,null,null,null,null,null,null,null,null,null,null,"Mississippi","Itawamba County","Not Eligible for Credit"]
[null,null,null,null,null,null,null,null,null,null,null,null,null,"Mississippi","Jackson County","Not Eligible for Credit"]
[null,null,null,null,null,null,null,null,null,null,null,null,null,"Mississippi","Jasper County",2]
[null,null,null,null,null,null,null,null,null,null,null,null,null,"Mississippi","Jefferson County","Not Eligible for Credit"]
[null,null,null,null,null,null,null,null,null,null,null,null,null,"Mississippi","Jefferson Davis County",2]
[null,null,null,null,null,null,null,null,null,null,null,null,null,"Mississippi","Jones County",2]
[null,null,null,null,null,null,null,null,null,null,null,null,null,"Mississippi","Kemper County","Not Eligible for Credit"]
[null,null,null,null,null,null,null,null,null,null,null,null,null,"Mississippi","Lafayette County","Not Eligible for Credit"]
[null,null,null,null,null,null,null,null,null,null,null,null,null,"Mississippi","Lamar County","Not Eligible for Credit"]
[null,null,null,null,null,null,null,null,null,null,null,null,null,"Mississippi","Lauderdale County",2]
[null,null,null,null,null,null,null,null,null,null,null,null,null,"Mississippi","Lawrence County",2]
[null,null,null,null,null,null,null,null,null,null,null,null,null,"Mississippi","Leake County",2]
[null,null,null,null,null,null,null,null,null,null,null,null,null,"Mississippi","Lee County","Not Eligible for Credit"]
[null,null,null,null,null,null,null,null,null,null,null,null,null,"Mississippi","Leflore County","Not Eligible for Credit"]
[null,null,null,null,null,null,null,null,null,null,null,null,null,"Mississippi","Lincoln County",2]
[null,null,null,null,null,null,null,null,null,null,null,null,null,"Mississippi","Lowndes County","Not Eligible for Credit"]
[null,null,null,null,null,null,null,null,null,null,null,null,null,"Mississippi","Madison County","Not Eligible for Credit"]
[null,null,null,null,null,null,null,null,null,null,null,null,null,"Mississippi","Marion County",2]
[null,null,null,null,null,null,null,null,null,null,null,null,null,"Mississippi","Marshall County","Not Eligible for Credit"]
[null,null,null,null,null,null,null,null,null,null,null,null,null,"Mississippi","Monroe County",2]
[null,null,null,null,null,null,null,null,null,null,null,null,null,"Mississippi","Montgomery County","Not Eligible for Credit"]
[null,null,null,null,null,null,null,null,null,null,null,null,null,"Mississippi","Neshoba County",2]
[null,null,null,null,null,null,null,null,null,null,null,null,null,"Mississippi","Newton County",2]
[null,null,null,null,null,null,null,null,null,null,null,null,null,"Mississippi","Noxubee County","Not Eligible for Credit"]
[null,null,null,null,null,null,null,null,null,null,null,null,null,"Mississippi","Oktibbeha County","Not Eligible for Credit"]
[null,null,null,null,null,null,null,null,null,null,null,null,null,"Mississippi","Panola County","Not Eligible for Credit"]
[null,null,null,null,null,null,null,null,null,null,null,null,null,"Mississippi","Pearl River County","Not Eligible for Credit"]
[null,null,null,null,null,null,null,null,null,null,null,null,null,"Mississippi","Perry County","Not Eligible for Credit"]
[null,null,null,null,null,null,null,null,null,null,null,null,null,"Mississippi","Pike County",2]
[null,null,null,null,null,null,null,null,null,null,null,null,null,"Mississippi","Pontotoc County","Not Eligible for Credit"]
[null,null,null,null,null,null,null,null,null,null,null,null,null,"Mississippi","Prentiss County",2]
[null,null,null,null,null,null,null,null,null,null,null,null,null,"Mississippi","Quitman County","Not Eligible for Credit"]
[null,null,null,null,null,null,null,null,null,null,null,null,null,"Mississippi","Rankin County",2]
[null,null,null,null,null,null,null,null,null,null,null,null,null,"Mississippi","Scott County","Not Eligible for Credit"]
[null,null,null,null,null,null,null,null,null,null,null,null,null,"Mississippi","Sharkey County","Not Eligible for Credit"]
[null,null,null,null,null,null,null,null,null,null,null,null,null,"Mississippi","Simpson County",2]
[null,null,null,null,null,null,null,null,null,null,null,null,null,"Mississippi","Smith County",2]
[null,null,null,null,null,null,null,null,null,null,null,null,null,"Mississippi","Stone County",2]
[null,null,null,null,null,null,null,null,null,null,null,null,null,"Mississippi","Sunflower County","Not Eligible for Credit"]
[null,null,null,null,null,null,null,null,null,null,null,null,null,"Mississippi","Tallahatchie County","Not Eligible for Credit"]
[null,null,null,null,null,null,null,null,null,null,null,null,null,"Mississippi","Tate County","Not Eligible for Credit"]
[null,null,null,null,null,null,null,null,null,null,null,null,null,"Mississippi","Tippah County",2]
[null,null,null,null,null,null,null,null,null,null,null,null,null,"Mississippi","Tishomingo County",2]
[null,null,null,null,null,null,null,null,null,null,null,null,null,"Mississippi","Tunica County","Not Eligible for Credit"]
[null,null,null,null,null,null,null,null,null,null,null,null,null,"Mississippi","Union County","Not Eligible for Credit"]
[null,null,null,null,null,null,null,null,null,null,null,null,null,"Mississippi","Walthall County",2]
[null,null,null,null,null,null,null,null,null,null,null,null,null,"Mississippi","Warren County","Not Eligible for Credit"]
[null,null,null,null,null,null,null,null,null,null,null,null,null,"Mississippi","Washington County","Not Eligible for Credit"]
[null,null,null,null,null,null,null,null,null,null,null,null,null,"Mississippi","Wayne County",2]
[null,null,null,null,null,null,null,null,null,null,null,null,null,"Mississippi","Webster County","Not Eligible for Credit"]
[null,null,null,null,null,null,null,null,null,null,null,null,null,"Mississippi","Wilkinson County",2]
[null,null,null,null,null,null,null,null,null,null,null,null,null,"Mississippi","Winston County",2]
[null,null,null,null,null,null,null,null,null,null,null,null,null,"Mississippi","Yalobusha County","Not Eligible for Credit"]
[null,null,null,null,null,null,null,null,null,null,null,null,null,"Mississippi","Yazoo County","Not Eligible for Credit"]
[null,null,null,null,null,null,null,null,null,null,null,null,null,"Missouri","Adair County","Not Eligible for Credit"]
[null,null,null,null,null,null,null,null,null,null,null,null,null,"Missouri","Andrew County","Not Eligible for Credit"]
[null,null,null,null,null,null,null,null,null,null,null,null,null,"Missouri","Atchison County","Not Eligible for Credit"]
[null,null,null,null,null,null,null,null,null,null,null,null,null,"Missouri","Audrain County","Not Eligible for Credit"]
[null,null,null,null,null,null,null,null,null,null,null,null,null,"Missouri","Barry County","Not Eligible for Credit"]
[null,null,null,null,null,null,null,null,null,null,null,null,null,"Missouri","Barton County","Not Eligible for Credit"]
[null,null,null,null,null,null,null,null,null,null,null,null,null,"Missouri","Bates County","Not Eligible for Credit"]
[null,null,null,null,null,null,null,null,null,null,null,null,null,"Missouri","Benton County","Not Eligible for Credit"]
[null,null,null,null,null,null,null,null,null,null,null,null,null,"Missouri","Bollinger County",2]
[null,null,null,null,null,null,null,null,null,null,null,null,null,"Missouri","Boone County","Not Eligible for Credit"]
[null,null,null,null,null,null,null,null,null,null,null,null,null,"Missouri","Buchanan County","Not Eligible for Credit"]
[null,null,null,null,null,null,null,null,null,null,null,null,null,"Missouri","Butler County",2]
[null,null,null,null,null,null,null,null,null,null,null,null,null,"Missouri","Caldwell County","Not Eligible for Credit"]
[null,null,null,null,null,null,null,null,null,null,null,null,null,"Missouri","Callaway County","Not Eligible for Credit"]
[null,null,null,null,null,null,null,null,null,null,null,null,null,"Missouri","Camden County","Not Eligible for Credit"]
[null,null,null,null,null,null,null,null,null,null,null,null,null,"Missouri","Cape Girardeau County",2]
[null,null,null,null,null,null,null,null,null,null,null,null,null,"Missouri","Carroll County","Not Eligible for Credit"]
[null,null,null,null,null,null,null,null,null,null,null,null,null,"Missouri","Carter County",2]
[null,null,null,null,null,null,null,null,null,null,null,null,null,"Missouri","Cass County","Not Eligible for Credit"]
[null,null,null,null,null,null,null,null,null,null,null,null,null,"Missouri","Cedar County","Not Eligible for Credit"]
[null,null,null,null,null,null,null,null,null,null,null,null,null,"Missouri","Chariton County","Not Eligible for Credit"]
[null,null,null,null,null,null,null,null,null,null,null,null,null,"Missouri","Christian County",2]
[null,null,null,null,null,null,null,null,null,null,null,null,null,"Missouri","Clark County","Not Eligible for Credit"]
[null,null,null,null,null,null,null,null,null,null,null,null,null,"Missouri","Clay County","Not Eligible for Credit"]
[null,null,null,null,null,null,null,null,null,null,null,null,null,"Missouri","Clinton County","Not Eligible for Credit"]
[null,null,null,null,null,null,null,null,null,null,null,null,null,"Missouri","Cole County",2]
[null,null,null,null,null,null,null,null,null,null,null,null,null,"Missouri","Cooper County","Not Eligible for Credit"]
[null,null,null,null,null,null,null,null,null,null,null,null,null,"Missouri","Crawford County",2]
[null,null,null,null,null,null,null,null,null,null,null,null,null,"Missouri","Dade County","Not Eligible for Credit"]
[null,null,null,null,null,null,null,null,null,null,null,null,null,"Missouri","Dallas County","Not Eligible for Credit"]
[null,null,null,null,null,null,null,null,null,null,null,null,null,"Missouri","Daviess County","Not Eligible for Credit"]
[null,null,null,null,null,null,null,null,null,null,null,null,null,"Missouri","DeKalb County","Not Eligible for Credit"]
[null,null,null,null,null,null,null,null,null,null,null,null,null,"Missouri","Dent County",2]
[null,null,null,null,null,null,null,null,null,null,null,null,null,"Missouri","Douglas County",2]
[null,null,null,null,null,null,null,null,null,null,null,null,null,"Missouri","Dunklin County","Not Eligible for Credit"]
[null,null,null,null,null,null,null,null,null,null,null,null,null,"Missouri","Franklin County",2]
[null,null,null,null,null,null,null,null,null,null,null,null,null,"Missouri","Gasconade County","Not Eligible for Credit"]
[null,null,null,null,null,null,null,null,null,null,null,null,null,"Missouri","Gentry County","Not Eligible for Credit"]
[null,null,null,null,null,null,null,null,null,null,null,null,null,"Missouri","Greene County","Not Eligible for Credit"]
[null,null,null,null,null,null,null,null,null,null,null,null,null,"Missouri","Grundy County","Not Eligible for Credit"]
[null,null,null,null,null,null,null,null,null,null,null,null,null,"Missouri","Harrison County","Not Eligible for Credit"]
[null,null,null,null,null,null,null,null,null,null,null,null,null,"Missouri","Henry County","Not Eligible for Credit"]
[null,null,null,null,null,null,null,null,null,null,null,null,null,"Missouri","Hickory County","Not Eligible for Credit"]
[null,null,null,null,null,null,null,null,null,null,null,null,null,"Missouri","Holt County","Not Eligible for Credit"]
[null,null,null,null,null,null,null,null,null,null,null,null,null,"Missouri","Howard County","Not Eligible for Credit"]
[null,null,null,null,null,null,null,null,null,null,null,null,null,"Missouri","Howell County",2]
[null,null,null,null,null,null,null,null,null,null,null,null,null,"Missouri","Iron County",2]
[null,null,null,null,null,null,null,null,null,null,null,null,null,"Missouri","Jackson County","Not Eligible for Credit"]
[null,null,null,null,null,null,null,null,null,null,null,null,null,"Missouri","Jasper County","Not Eligible for Credit"]
[null,null,null,null,null,null,null,null,null,null,null,null,null,"Missouri","Jefferson County",2]
[null,null,null,null,null,null,null,null,null,null,null,null,null,"Missouri","Johnson County","Not Eligible for Credit"]
[null,null,null,null,null,null,null,null,null,null,null,null,null,"Missouri","Knox County","Not Eligible for Credit"]
[null,null,null,null,null,null,null,null,null,null,null,null,null,"Missouri","Laclede County","Not Eligible for Credit"]
[null,null,null,null,null,null,null,null,null,null,null,null,null,"Missouri","Lafayette County","Not Eligible for Credit"]
[null,null,null,null,null,null,null,null,null,null,null,null,null,"Missouri","Lawrence County","Not Eligible for Credit"]
[null,null,null,null,null,null,null,null,null,null,null,null,null,"Missouri","Lewis County","Not Eligible for Credit"]
[null,null,null,null,null,null,null,null,null,null,null,null,null,"Missouri","Lincoln County",2]
[null,null,null,null,null,null,null,null,null,null,null,null,null,"Missouri","Linn County","Not Eligible for Credit"]
[null,null,null,null,null,null,null,null,null,null,null,null,null,"Missouri","Livingston County","Not Eligible for Credit"]
[null,null,null,null,null,null,null,null,null,null,null,null,null,"Missouri","Macon County","Not Eligible for Credit"]
[null,null,null,null,null,null,null,null,null,null,null,null,null,"Missouri","Madison County",2]
[null,null,null,null,null,null,null,null,null,null,null,null,null,"Missouri","Maries County",2]
[null,null,null,null,null,null,null,null,null,null,null,null,null,"Missouri","Marion County","Not Eligible for Credit"]
[null,null,null,null,null,null,null,null,null,null,null,null,null,"Missouri","McDonald County",2]
[null,null,null,null,null,null,null,null,null,null,null,null,null,"Missouri","Mercer County","Not Eligible for Credit"]
[null,null,null,null,null,null,null,null,null,null,null,null,null,"Missouri","Miller County",2]
[null,null,null,null,null,null,null,null,null,null,null,null,null,"Missouri","Mississippi County","Not Eligible for Credit"]
[null,null,null,null,null,null,null,null,null,null,null,null,null,"Missouri","Moniteau County","Not Eligible for Credit"]
[null,null,null,null,null,null,null,null,null,null,null,null,null,"Missouri","Monroe County","Not Eligible for Credit"]
[null,null,null,null,null,null,null,null,null,null,null,null,null,"Missouri","Montgomery County","Not Eligible for Credit"]
[null,null,null,null,null,null,null,null,null,null,null,null,null,"Missouri","Morgan County","Not Eligible for Credit"]
[null,null,null,null,null,null,null,null,null,null,null,null,null,"Missouri","New Madrid County","Not Eligible for Credit"]
[null,null,null,null,null,null,null,null,null,null,null,null,null,"Missouri","Newton County","Not Eligible for Credit"]
[null,null,null,null,null,null,null,null,null,null,null,null,null,"Missouri","Nodaway County","Not Eligible for Credit"]
[null,null,null,null,null,null,null,null,null,null,null,null,null,"Missouri","Oregon County",2]
[null,null,null,null,null,null,null,null,null,null,null,null,null,"Missouri","Osage County","Not Eligible for Credit"]
[null,null,null,null,null,null,null,null,null,null,null,null,null,"Missouri","Ozark County",2]
[null,null,null,null,null,null,null,null,null,null,null,null,null,"Missouri","Pemiscot County","Not Eligible for Credit"]
[null,null,null,null,null,null,null,null,null,null,null,null,null,"Missouri","Perry County",2]
[null,null,null,null,null,null,null,null,null,null,null,null,null,"Missouri","Pettis County","Not Eligible for Credit"]
[null,null,null,null,null,null,null,null,null,null,null,null,null,"Missouri","Phelps County",2]
[null,null,null,null,null,null,null,null,null,null,null,null,null,"Missouri","Pike County","Not Eligible for Credit"]
[null,null,null,null,null,null,null,null,null,null,null,null,null,"Missouri","Platte County","Not Eligible for Credit"]
[null,null,null,null,null,null,null,null,null,null,null,null,null,"Missouri","Polk County","Not Eligible for Credit"]
[null,null,null,null,null,null,null,null,null,null,null,null,null,"Missouri","Pulaski County",2]
[null,null,null,null,null,null,null,null,null,null,null,null,null,"Missouri","Putnam County","Not Eligible for Credit"]
[null,null,null,null,null,null,null,null,null,null,null,null,null,"Missouri","Ralls County","Not Eligible for Credit"]
[null,null,null,null,null,null,null,null,null,null,null,null,null,"Missouri","Randolph County","Not Eligible for Credit"]
[null,null,null,null,null,null,null,null,null,null,null,null,null,"Missouri","Ray County","Not Eligible for Credit"]
[null,null,null,null,null,null,null,null,null,null,null,null,null,"Missouri","Reynolds County",2]
[null,null,null,null,null,null,null,null,null,null,null,null,null,"Missouri","Ripley County","Not Eligible for Credit"]
[null,null,null,null,null,null,null,null,null,null,null,null,null,"Missouri","Saline County","Not Eligible for Credit"]
[null,null,null,null,null,null,null,null,null,null,null,null,null,"Missouri","Schuyler County","Not Eligible for Credit"]
[null,null,null,null,null,null,null,null,null,null,null,null,null,"Missouri","Scotland County","Not Eligible for Credit"]
[null,null,null,null,null,null,null,null,null,null,null,null,null,"Missouri","Scott County",2]
[null,null,null,null,null,null,null,null,null,null,null,null,null,"Missouri","Shannon County",2]
[null,null,null,null,null,null,null,null,null,null,null,null,null,"Missouri","Shelby County","Not Eligible for Credit"]
[null,null,null,null,null,null,null,null,null,null,null,null,null,"Missouri","St. Charles County",2]
[null,null,null,null,null,null,null,null,null,null,null,null,null,"Missouri","St. Clair County","Not Eligible for Credit"]
[null,null,null,null,null,null,null,null,null,null,null,null,null,"Missouri","St. Francois County",2]
[null,null,null,null,null,null,null,null,null,null,null,null,null,"Missouri","St. Louis City",2]
[null,null,null,null,null,null,null,null,null,null,null,null,null,"Missouri","St. Louis County",2]
[null,null,null,null,null,null,null,null,null,null,null,null,null,"Missouri","Ste. Genevieve County",2]
[null,null,null,null,null,null,null,null,null,null,null,null,null,"Missouri","Stoddard County","Not Eligible for Credit"]
[null,null,null,null,null,null,null,null,null,null,null,null,null,"Missouri","Stone County",2]
[null,null,null,null,null,null,null,null,null,null,null,null,null,"Missouri","Sullivan County","Not Eligible for Credit"]
[null,null,null,null,null,null,null,null,null,null,null,null,null,"Missouri","Taney County",2]
[null,null,null,null,null,null,null,null,null,null,null,null,null,"Missouri","Texas County",2]
[null,null,null,null,null,null,null,null,null,null,null,null,null,"Missouri","Vernon County","Not Eligible for Credit"]
[null,null,null,null,null,null,null,null,null,null,null,null,null,"Missouri","Warren County",2]
[null,null,null,null,null,null,null,null,null,null,null,null,null,"Missouri","Washington County",2]
[null,null,null,null,null,null,null,null,null,null,null,null,null,"Missouri","Wayne County",2]
[null,null,null,null,null,null,null,null,null,null,null,null,null,"Missouri","Webster County","Not Eligible for Credit"]
[null,null,null,null,null,null,null,null,null,null,null,null,null,"Missouri","Worth County","Not Eligible for Credit"]
[null,null,null,null,null,null,null,null,null,null,null,null,null,"Missouri","Wright County","Not Eligible for Credit"]
[null,null,null,null,null,null,null,null,null,null,null,null,null,"Montana","Beaverhead County",3]
[null,null,null,null,null,null,null,null,null,null,null,null,null,"Montana","Big Horn County",3]
[null,null,null,null,null,null,null,null,null,null,null,null,null,"Montana","Blaine County",3]
[null,null,null,null,null,null,null,null,null,null,null,null,null,"Montana","Broadwater County",3]
[null,null,null,null,null,null,null,null,null,null,null,null,null,"Montana","Carbon County",3]
[null,null,null,null,null,null,null,null,null,null,null,null,null,"Montana","Carter County",3]
[null,null,null,null,null,null,null,null,null,null,null,null,null,"Montana","Cascade County",3]
[null,null,null,null,null,null,null,null,null,null,null,null,null,"Montana","Chouteau County",3]
[null,null,null,null,null,null,null,null,null,null,null,null,null,"Montana","Custer County",3]
[null,null,null,null,null,null,null,null,null,null,null,null,null,"Montana","Daniels County",3]
[null,null,null,null,null,null,null,null,null,null,null,null,null,"Montana","Dawson County",3]
[null,null,null,null,null,null,null,null,null,null,null,null,null,"Montana","Deer Lodge County",3]
[null,null,null,null,null,null,null,null,null,null,null,null,null,"Montana","Fallon County",3]
[null,null,null,null,null,null,null,null,null,null,null,null,null,"Montana","Fergus County",3]
[null,null,null,null,null,null,null,null,null,null,null,null,null,"Montana","Flathead County",3]
[null,null,null,null,null,null,null,null,null,null,null,null,null,"Montana","Gallatin County",3]
[null,null,null,null,null,null,null,null,null,null,null,null,null,"Montana","Garfield County",3]
[null,null,null,null,null,null,null,null,null,null,null,null,null,"Montana","Glacier County",2]
[null,null,null,null,null,null,null,null,null,null,null,null,null,"Montana","Golden Valley County",3]
[null,null,null,null,null,null,null,null,null,null,null,null,null,"Montana","Granite County",3]
[null,null,null,null,null,null,null,null,null,null,null,null,null,"Montana","Hill County",3]
[null,null,null,null,null,null,null,null,null,null,null,null,null,"Montana","Jefferson County",3]
[null,null,null,null,null,null,null,null,null,null,null,null,null,"Montana","Judith Basin County",3]
[null,null,null,null,null,null,null,null,null,null,null,null,null,"Montana","Lake County",3]
[null,null,null,null,null,null,null,null,null,null,null,null,null,"Montana","Lewis and Clark County",3]
[null,null,null,null,null,null,null,null,null,null,null,null,null,"Montana","Liberty County",3]
[null,null,null,null,null,null,null,null,null,null,null,null,null,"Montana","Lincoln County",3]
[null,null,null,null,null,null,null,null,null,null,null,null,null,"Montana","Madison County",3]
[null,null,null,null,null,null,null,null,null,null,null,null,null,"Montana","McCone County",3]
[null,null,null,null,null,null,null,null,null,null,null,null,null,"Montana","Meagher County",3]
[null,null,null,null,null,null,null,null,null,null,null,null,null,"Montana","Mineral County",3]
[null,null,null,null,null,null,null,null,null,null,null,null,null,"Montana","Missoula County",3]
[null,null,null,null,null,null,null,null,null,null,null,null,null,"Montana","Musselshell County",3]
[null,null,null,null,null,null,null,null,null,null,null,null,null,"Montana","Park County",3]
[null,null,null,null,null,null,null,null,null,null,null,null,null,"Montana","Petroleum County",3]
[null,null,null,null,null,null,null,null,null,null,null,null,null,"Montana","Phillips County",3]
[null,null,null,null,null,null,null,null,null,null,null,null,null,"Montana","Pondera County",3]
[null,null,null,null,null,null,null,null,null,null,null,null,null,"Montana","Powder River County",3]
[null,null,null,null,null,null,null,null,null,null,null,null,null,"Montana","Powell County",3]
[null,null,null,null,null,null,null,null,null,null,null,null,null,"Montana","Prairie County",3]
[null,null,null,null,null,null,null,null,null,null,null,null,null,"Montana","Ravalli County",3]
[null,null,null,null,null,null,null,null,null,null,null,null,null,"Montana","Richland County",3]
[null,null,null,null,null,null,null,null,null,null,null,null,null,"Montana","Roosevelt County",3]
[null,null,null,null,null,null,null,null,null,null,null,null,null,"Montana","Rosebud County",3]
[null,null,null,null,null,null,null,null,null,null,null,null,null,"Montana","Sanders County",3]
[null,null,null,null,null,null,null,null,null,null,null,null,null,"Montana","Sheridan County",3]
[null,null,null,null,null,null,null,null,null,null,null,null,null,"Montana","Silver Bow County",3]
[null,null,null,null,null,null,null,null,null,null,null,null,null,"Montana","Stillwater County",3]
[null,null,null,null,null,null,null,null,null,null,null,null,null,"Montana","Sweet Grass County",3]
[null,null,null,null,null,null,null,null,null,null,null,null,null,"Montana","Teton County",3]
[null,null,null,null,null,null,null,null,null,null,null,null,null,"Montana","Toole County",3]
[null,null,null,null,null,null,null,null,null,null,null,null,null,"Montana","Treasure County",3]
[null,null,null,null,null,null,null,null,null,null,null,null,null,"Montana","Valley County",3]
[null,null,null,null,null,null,null,null,null,null,null,null,null,"Montana","Wheatland County",3]
[null,null,null,null,null,null,null,null,null,null,null,null,null,"Montana","Wibaux County",3]
[null,null,null,null,null,null,null,null,null,null,null,null,null,"Montana","Yellowstone County",3]
[null,null,null,null,null,null,null,null,null,null,null,null,null,"Nebraska","Adams County",2]
[null,null,null,null,null,null,null,null,null,null,null,null,null,"Nebraska","Antelope County",2]
[null,null,null,null,null,null,null,null,null,null,null,null,null,"Nebraska","Arthur County",3]
[null,null,null,null,null,null,null,null,null,null,null,null,null,"Nebraska","Banner County",3]
[null,null,null,null,null,null,null,null,null,null,null,null,null,"Nebraska","Blaine County",3]
[null,null,null,null,null,null,null,null,null,null,null,null,null,"Nebraska","Boone County",2]
[null,null,null,null,null,null,null,null,null,null,null,null,null,"Nebraska","Box Butte County",3]
[null,null,null,null,null,null,null,null,null,null,null,null,null,"Nebraska","Boyd County",2]
[null,null,null,null,null,null,null,null,null,null,null,null,null,"Nebraska","Brown County",3]
[null,null,null,null,null,null,null,null,null,null,null,null,null,"Nebraska","Buffalo County",2]
[null,null,null,null,null,null,null,null,null,null,null,null,null,"Nebraska","Burt County",2]
[null,null,null,null,null,null,null,null,null,null,null,null,null,"Nebraska","Butler County",2]
[null,null,null,null,null,null,null,null,null,null,null,null,null,"Nebraska","Cass County","Not Eligible for Credit"]
[null,null,null,null,null,null,null,null,null,null,null,null,null,"Nebraska","Cedar County",2]
[null,null,null,null,null,null,null,null,null,null,null,null,null,"Nebraska","Chase County",3]
[null,null,null,null,null,null,null,null,null,null,null,null,null,"Nebraska","Cherry County",6]
[null,null,null,null,null,null,null,null,null,null,null,null,null,"Nebraska","Cheyenne County",3]
[null,null,null,null,null,null,null,null,null,null,null,null,null,"Nebraska","Clay County",2]
[null,null,null,null,null,null,null,null,null,null,null,null,null,"Nebraska","Colfax County",2]
[null,null,null,null,null,null,null,null,null,null,null,null,null,"Nebraska","Cuming County",2]
[null,null,null,null,null,null,null,null,null,null,null,null,null,"Nebraska","Custer County",2]
[null,null,null,null,null,null,null,null,null,null,null,null,null,"Nebraska","Dakota County",2]
[null,null,null,null,null,null,null,null,null,null,null,null,null,"Nebraska","Dawes County",3]
[null,null,null,null,null,null,null,null,null,null,null,null,null,"Nebraska","Dawson County",2]
[null,null,null,null,null,null,null,null,null,null,null,null,null,"Nebraska","Deuel County",3]
[null,null,null,null,null,null,null,null,null,null,null,null,null,"Nebraska","Dixon County",2]
[null,null,null,null,null,null,null,null,null,null,null,null,null,"Nebraska","Dodge County","Not Eligible for Credit"]
[null,null,null,null,null,null,null,null,null,null,null,null,null,"Nebraska","Douglas County",2]
[null,null,null,null,null,null,null,null,null,null,null,null,null,"Nebraska","Dundy County",3]
[null,null,null,null,null,null,null,null,null,null,null,null,null,"Nebraska","Fillmore County","Not Eligible for Credit"]
[null,null,null,null,null,null,null,null,null,null,null,null,null,"Nebraska","Franklin County",2]
[null,null,null,null,null,null,null,null,null,null,null,null,null,"Nebraska","Frontier County",2]
[null,null,null,null,null,null,null,null,null,null,null,null,null,"Nebraska","Furnas County",2]
[null,null,null,null,null,null,null,null,null,null,null,null,null,"Nebraska","Gage County","Not Eligible for Credit"]
[null,null,null,null,null,null,null,null,null,null,null,null,null,"Nebraska","Garden County",3]
[null,null,null,null,null,null,null,null,null,null,null,null,null,"Nebraska","Garfield County",3]
[null,null,null,null,null,null,null,null,null,null,null,null,null,"Nebraska","Gosper County",2]
[null,null,null,null,null,null,null,null,null,null,null,null,null,"Nebraska","Grant County",6]
[null,null,null,null,null,null,null,null,null,null,null,null,null,"Nebraska","Greeley County",2]
[null,null,null,null,null,null,null,null,null,null,null,null,null,"Nebraska","Hall County",2]
[null,null,null,null,null,null,null,null,null,null,null,null,null,"Nebraska","Hamilton County",2]
[null,null,null,null,null,null,null,null,null,null,null,null,null,"Nebraska","Harlan County",2]
[null,null,null,null,null,null,null,null,null,null,null,null,null,"Nebraska","Hayes County",3]
[null,null,null,null,null,null,null,null,null,null,null,null,null,"Nebraska","Hitchcock County",2]
[null,null,null,null,null,null,null,null,null,null,null,null,null,"Nebraska","Holt County",3]
[null,null,null,null,null,null,null,null,null,null,null,null,null,"Nebraska","Hooker County",6]
[null,null,null,null,null,null,null,null,null,null,null,null,null,"Nebraska","Howard County",2]
[null,null,null,null,null,null,null,null,null,null,null,null,null,"Nebraska","Jefferson County","Not Eligible for Credit"]
[null,null,null,null,null,null,null,null,null,null,null,null,null,"Nebraska","Johnson County","Not Eligible for Credit"]
[null,null,null,null,null,null,null,null,null,null,null,null,null,"Nebraska","Kearney County","Not Eligible for Credit"]
[null,null,null,null,null,null,null,null,null,null,null,null,null,"Nebraska","Keith County",3]
[null,null,null,null,null,null,null,null,null,null,null,null,null,"Nebraska","Keya Paha County",2]
[null,null,null,null,null,null,null,null,null,null,null,null,null,"Nebraska","Kimball County",3]
[null,null,null,null,null,null,null,null,null,null,null,null,null,"Nebraska","Knox County",2]
[null,null,null,null,null,null,null,null,null,null,null,null,null,"Nebraska","Lancaster County","Not Eligible for Credit"]
[null,null,null,null,null,null,null,null,null,null,null,null,null,"Nebraska","Lincoln County",3]
[null,null,null,null,null,null,null,null,null,null,null,null,null,"Nebraska","Logan County",6]
[null,null,null,null,null,null,null,null,null,null,null,null,null,"Nebraska","Loup County",3]
[null,null,null,null,null,null,null,null,null,null,null,null,null,"Nebraska","Madison County",2]
[null,null,null,null,null,null,null,null,null,null,null,null,null,"Nebraska","McPherson County",3]
[null,null,null,null,null,null,null,null,null,null,null,null,null,"Nebraska","Merrick County",2]
[null,null,null,null,null,null,null,null,null,null,null,null,null,"Nebraska","Morrill County",3]
[null,null,null,null,null,null,null,null,null,null,null,null,null,"Nebraska","Nance County",2]
[null,null,null,null,null,null,null,null,null,null,null,null,null,"Nebraska","Nemaha County","Not Eligible for Credit"]
[null,null,null,null,null,null,null,null,null,null,null,null,null,"Nebraska","Nuckolls County",2]
[null,null,null,null,null,null,null,null,null,null,null,null,null,"Nebraska","Otoe County","Not Eligible for Credit"]
[null,null,null,null,null,null,null,null,null,null,null,null,null,"Nebraska","Pawnee County","Not Eligible for Credit"]
[null,null,null,null,null,null,null,null,null,null,null,null,null,"Nebraska","Perkins County",3]
[null,null,null,null,null,null,null,null,null,null,null,null,null,"Nebraska","Phelps County",2]
[null,null,null,null,null,null,null,null,null,null,null,null,null,"Nebraska","Pierce County",2]
[null,null,null,null,null,null,null,null,null,null,null,null,null,"Nebraska","Platte County",2]
[null,null,null,null,null,null,null,null,null,null,null,null,null,"Nebraska","Polk County",2]
[null,null,null,null,null,null,null,null,null,null,null,null,null,"Nebraska","Red Willow County",3]
[null,null,null,null,null,null,null,null,null,null,null,null,null,"Nebraska","Richardson County","Not Eligible for Credit"]
[null,null,null,null,null,null,null,null,null,null,null,null,null,"Nebraska","Rock County",3]
[null,null,null,null,null,null,null,null,null,null,null,null,null,"Nebraska","Saline County","Not Eligible for Credit"]
[null,null,null,null,null,null,null,null,null,null,null,null,null,"Nebraska","Sarpy County",2]
[null,null,null,null,null,null,null,null,null,null,null,null,null,"Nebraska","Saunders County",2]
[null,null,null,null,null,null,null,null,null,null,null,null,null,"Nebraska","Scotts Bluff County",3]
[null,null,null,null,null,null,null,null,null,null,null,null,null,"Nebraska","Seward County",2]
[null,null,null,null,null,null,null,null,null,null,null,null,null,"Nebraska","Sheridan County",3]
[null,null,null,null,null,null,null,null,null,null,null,null,null,"Nebraska","Sherman County",2]
[null,null,null,null,null,null,null,null,null,null,null,null,null,"Nebraska","Sioux County",3]
[null,null,null,null,null,null,null,null,null,null,null,null,null,"Nebraska","Stanton County",2]
[null,null,null,null,null,null,null,null,null,null,null,null,null,"Nebraska","Thayer County",2]
[null,null,null,null,null,null,null,null,null,null,null,null,null,"Nebraska","Thomas County",3]
[null,null,null,null,null,null,null,null,null,null,null,null,null,"Nebraska","Thurston County",2]
[null,null,null,null,null,null,null,null,null,null,null,null,null,"Nebraska","Valley County",2]
[null,null,null,null,null,null,null,null,null,null,null,null,null,"Nebraska","Washington County",2]
[null,null,null,null,null,null,null,null,null,null,null,null,null,"Nebraska","Wayne County",2]
[null,null,null,null,null,null,null,null,null,null,null,null,null,"Nebraska","Webster County",2]
[null,null,null,null,null,null,null,null,null,null,null,null,null,"Nebraska","Wheeler County",3]
[null,null,null,null,null,null,null,null,null,null,null,null,null,"Nebraska","York County",2]
[null,null,null,null,null,null,null,null,null,null,null,null,null,"Nevada","Carson City",3]
[null,null,null,null,null,null,null,null,null,null,null,null,null,"Nevada","Churchill County",6]
[null,null,null,null,null,null,null,null,null,null,null,null,null,"Nevada","Clark County",6]
[null,null,null,null,null,null,null,null,null,null,null,null,null,"Nevada","Douglas County",3]
[null,null,null,null,null,null,null,null,null,null,null,null,null,"Nevada","Elko County",3]
[null,null,null,null,null,null,null,null,null,null,null,null,null,"Nevada","Esmeralda County",6]
[null,null,null,null,null,null,null,null,null,null,null,null,null,"Nevada","Eureka County",3]
[null,null,null,null,null,null,null,null,null,null,null,null,null,"Nevada","Humboldt County",6]
[null,null,null,null,null,null,null,null,null,null,null,null,null,"Nevada","Lander County",3]
[null,null,null,null,null,null,null,null,null,null,null,null,null,"Nevada","Lincoln County",6]
[null,null,null,null,null,null,null,null,null,null,null,null,null,"Nevada","Lyon County",3]
[null,null,null,null,null,null,null,null,null,null,null,null,null,"Nevada","Mineral County",6]
[null,null,null,null,null,null,null,null,null,null,null,null,null,"Nevada","Nye County",6]
[null,null,null,null,null,null,null,null,null,null,null,null,null,"Nevada","Pershing County",6]
[null,null,null,null,null,null,null,null,null,null,null,null,null,"Nevada","Storey County",3]
[null,null,null,null,null,null,null,null,null,null,null,null,null,"Nevada","Washoe County",3]
[null,null,null,null,null,null,null,null,null,null,null,null,null,"Nevada","White Pine County",3]
[null,null,null,null,null,null,null,null,null,null,null,null,null,"New Hampshire","Belknap County",2]
[null,null,null,null,null,null,null,null,null,null,null,null,null,"New Hampshire","Carroll County",2]
[null,null,null,null,null,null,null,null,null,null,null,null,null,"New Hampshire","Cheshire County",2]
[null,null,null,null,null,null,null,null,null,null,null,null,null,"New Hampshire","Coos County",2]
[null,null,null,null,null,null,null,null,null,null,null,null,null,"New Hampshire","Grafton County",2]
[null,null,null,null,null,null,null,null,null,null,null,null,null,"New Hampshire","Hillsborough County",2]
[null,null,null,null,null,null,null,null,null,null,null,null,null,"New Hampshire","Merrimack County",2]
[null,null,null,null,null,null,null,null,null,null,null,null,null,"New Hampshire","Rockingham County",2]
[null,null,null,null,null,null,null,null,null,null,null,null,null,"New Hampshire","Strafford County","Not Eligible for Credit"]
[null,null,null,null,null,null,null,null,null,null,null,null,null,"New Hampshire","Sullivan County",2]
[null,null,null,null,null,null,null,null,null,null,null,null,null,"New Jersey","Atlantic County",3]
[null,null,null,null,null,null,null,null,null,null,null,null,null,"New Jersey","Bergen County",2]
[null,null,null,null,null,null,null,null,null,null,null,null,null,"New Jersey","Burlington County",2]
[null,null,null,null,null,null,null,null,null,null,null,null,null,"New Jersey","Camden County","Not Eligible for Credit"]
[null,null,null,null,null,null,null,null,null,null,null,null,null,"New Jersey","Cape May County",3]
[null,null,null,null,null,null,null,null,null,null,null,null,null,"New Jersey","Cumberland County",2]
[null,null,null,null,null,null,null,null,null,null,null,null,null,"New Jersey","Essex County","Not Eligible for Credit"]
[null,null,null,null,null,null,null,null,null,null,null,null,null,"New Jersey","Gloucester County","Not Eligible for Credit"]
[null,null,null,null,null,null,null,null,null,null,null,null,null,"New Jersey","Hudson County",2]
[null,null,null,null,null,null,null,null,null,null,null,null,null,"New Jersey","Hunterdon County","Not Eligible for Credit"]
[null,null,null,null,null,null,null,null,null,null,null,null,null,"New Jersey","Mercer County","Not Eligible for Credit"]
[null,null,null,null,null,null,null,null,null,null,null,null,null,"New Jersey","Middlesex County","Not Eligible for Credit"]
[null,null,null,null,null,null,null,null,null,null,null,null,null,"New Jersey","Monmouth County","Not Eligible for Credit"]
[null,null,null,null,null,null,null,null,null,null,null,null,null,"New Jersey","Morris County","Not Eligible for Credit"]
[null,null,null,null,null,null,null,null,null,null,null,null,null,"New Jersey","Ocean County",3]
[null,null,null,null,null,null,null,null,null,null,null,null,null,"New Jersey","Passaic County","Not Eligible for Credit"]
[null,null,null,null,null,null,null,null,null,null,null,null,null,"New Jersey","Salem County","Not Eligible for Credit"]
[null,null,null,null,null,null,null,null,null,null,null,null,null,"New Jersey","Somerset County","Not Eligible for Credit"]
[null,null,null,null,null,null,null,null,null,null,null,null,null,"New Jersey","Sussex County","Not Eligible for Credit"]
[null,null,null,null,null,null,null,null,null,null,null,null,null,"New Jersey","Union County","Not Eligible for Credit"]
[null,null,null,null,null,null,null,null,null,null,null,null,null,"New Jersey","Warren County","Not Eligible for Credit"]
[null,null,null,null,null,null,null,null,null,null,null,null,null,"New Mexico","Bernalillo County",6]
[null,null,null,null,null,null,null,null,null,null,null,null,null,"New Mexico","Catron County",6]
[null,null,null,null,null,null,null,null,null,null,null,null,null,"New Mexico","Chaves County",3]
[null,null,null,null,null,null,null,null,null,null,null,null,null,"New Mexico","Cibola County",6]
[null,null,null,null,null,null,null,null,null,null,null,null,null,"New Mexico","Colfax County",3]
[null,null,null,null,null,null,null,null,null,null,null,null,null,"New Mexico","Curry County",3]
[null,null,null,null,null,null,null,null,null,null,null,null,null,"New Mexico","De Baca County",3]
[null,null,null,null,null,null,null,null,null,null,null,null,null,"New Mexico","Doña Ana County",3]
[null,null,null,null,null,null,null,null,null,null,null,null,null,"New Mexico","Eddy County",3]
[null,null,null,null,null,null,null,null,null,null,null,null,null,"New Mexico","Grant County",6]
[null,null,null,null,null,null,null,null,null,null,null,null,null,"New Mexico","Guadalupe County",3]
[null,null,null,null,null,null,null,null,null,null,null,null,null,"New Mexico","Harding County",3]
[null,null,null,null,null,null,null,null,null,null,null,null,null,"New Mexico","Hidalgo County",3]
[null,null,null,null,null,null,null,null,null,null,null,null,null,"New Mexico","Lea County",3]
[null,null,null,null,null,null,null,null,null,null,null,null,null,"New Mexico","Lincoln County",3]
[null,null,null,null,null,null,null,null,null,null,null,null,null,"New Mexico","Los Alamos County",3]
[null,null,null,null,null,null,null,null,null,null,null,null,null,"New Mexico","Luna County",3]
[null,null,null,null,null,null,null,null,null,null,null,null,null,"New Mexico","McKinley County",6]
[null,null,null,null,null,null,null,null,null,null,null,null,null,"New Mexico","Mora County",3]
[null,null,null,null,null,null,null,null,null,null,null,null,null,"New Mexico","Otero County",3]
[null,null,null,null,null,null,null,null,null,null,null,null,null,"New Mexico","Quay County",3]
[null,null,null,null,null,null,null,null,null,null,null,null,null,"New Mexico","Rio Arriba County",3]
[null,null,null,null,null,null,null,null,null,null,null,null,null,"New Mexico","Roosevelt County",3]
[null,null,null,null,null,null,null,null,null,null,null,null,null,"New Mexico","San Juan County",6]
[null,null,null,null,null,null,null,null,null,null,null,null,null,"New Mexico","San Miguel County",3]
[null,null,null,null,null,null,null,null,null,null,null,null,null,"New Mexico","Sandoval County",6]
[null,null,null,null,null,null,null,null,null,null,null,null,null,"New Mexico","Santa Fe County",6]
[null,null,null,null,null,null,null,null,null,null,null,null,null,"New Mexico","Sierra County",6]
[null,null,null,null,null,null,null,null,null,null,null,null,null,"New Mexico","Socorro County",6]
[null,null,null,null,null,null,null,null,null,null,null,null,null,"New Mexico","Taos County",3]
[null,null,null,null,null,null,null,null,null,null,null,null,null,"New Mexico","Torrance County",3]
[null,null,null,null,null,null,null,null,null,null,null,null,null,"New Mexico","Union County",3]
[null,null,null,null,null,null,null,null,null,null,null,null,null,"New Mexico","Valencia County",3]
[null,null,null,null,null,null,null,null,null,null,null,null,null,"New York","Albany County",2]
[null,null,null,null,null,null,null,null,null,null,null,null,null,"New York","Allegany County",2]
[null,null,null,null,null,null,null,null,null,null,null,null,null,"New York","Bronx County",2]
[null,null,null,null,null,null,null,null,null,null,null,null,null,"New York","Broome County",2]
[null,null,null,null,null,null,null,null,null,null,null,null,null,"New York","Cattaraugus County",2]
[null,null,null,null,null,null,null,null,null,null,null,null,null,"New York","Cayuga County",2]
[null,null,null,null,null,null,null,null,null,null,null,null,null,"New York","Chautauqua County",2]
[null,null,null,null,null,null,null,null,null,null,null,null,null,"New York","Chemung County",2]
[null,null,null,null,null,null,null,null,null,null,null,null,null,"New York","Chenango County",2]
[null,null,null,null,null,null,null,null,null,null,null,null,null,"New York","Clinton County",3]
[null,null,null,null,null,null,null,null,null,null,null,null,null,"New York","Columbia County",2]
[null,null,null,null,null,null,null,null,null,null,null,null,null,"New York","Cortland County",2]
[null,null,null,null,null,null,null,null,null,null,null,null,null,"New York","Delaware County",2]
[null,null,null,null,null,null,null,null,null,null,null,null,null,"New York","Dutchess County",2]
[null,null,null,null,null,null,null,null,null,null,null,null,null,"New York","Erie County",2]
[null,null,null,null,null,null,null,null,null,null,null,null,null,"New York","Essex County",3]
[null,null,null,null,null,null,null,null,null,null,null,null,null,"New York","Franklin County",2]
[null,null,null,null,null,null,null,null,null,null,null,null,null,"New York","Fulton County",2]
[null,null,null,null,null,null,null,null,null,null,null,null,null,"New York","Genesee County",2]
[null,null,null,null,null,null,null,null,null,null,null,null,null,"New York","Greene County",2]
[null,null,null,null,null,null,null,null,null,null,null,null,null,"New York","Hamilton County",2]
[null,null,null,null,null,null,null,null,null,null,null,null,null,"New York","Herkimer County",2]
[null,null,null,null,null,null,null,null,null,null,null,null,null,"New York","Jefferson County",3]
[null,null,null,null,null,null,null,null,null,null,null,null,null,"New York","Kings County",2]
[null,null,null,null,null,null,null,null,null,null,null,null,null,"New York","Lewis County",2]
[null,null,null,null,null,null,null,null,null,null,null,null,null,"New York","Livingston County",2]
[null,null,null,null,null,null,null,null,null,null,null,null,null,"New York","Madison County",2]
[null,null,null,null,null,null,null,null,null,null,null,null,null,"New York","Monroe County",2]
[null,null,null,null,null,null,null,null,null,null,null,null,null,"New York","Montgomery County",2]
[null,null,null,null,null,null,null,null,null,null,null,null,null,"New York","Nassau County",3]
[null,null,null,null,null,null,null,null,null,null,null,null,null,"New York","New York County",2]
[null,null,null,null,null,null,null,null,null,null,null,null,null,"New York","Niagara County",2]
[null,null,null,null,null,null,null,null,null,null,null,null,null,"New York","Oneida County",2]
[null,null,null,null,null,null,null,null,null,null,null,null,null,"New York","Onondaga County",2]
[null,null,null,null,null,null,null,null,null,null,null,null,null,"New York","Ontario County",2]
[null,null,null,null,null,null,null,null,null,null,null,null,null,"New York","Orange County","Not Eligible for Credit"]
[null,null,null,null,null,null,null,null,null,null,null,null,null,"New York","Orleans County",2]
[null,null,null,null,null,null,null,null,null,null,null,null,null,"New York","Oswego County",2]
[null,null,null,null,null,null,null,null,null,null,null,null,null,"New York","Otsego County",2]
[null,null,null,null,null,null,null,null,null,null,null,null,null,"New York","Putnam County",2]
[null,null,null,null,null,null,null,null,null,null,null,null,null,"New York","Queens County",2]
[null,null,null,null,null,null,null,null,null,null,null,null,null,"New York","Rensselaer County",2]
[null,null,null,null,null,null,null,null,null,null,null,null,null,"New York","Richmond County","Not Eligible for Credit"]
[null,null,null,null,null,null,null,null,null,null,null,null,null,"New York","Rockland County",2]
[null,null,null,null,null,null,null,null,null,null,null,null,null,"New York","Saratoga County",2]
[null,null,null,null,null,null,null,null,null,null,null,null,null,"New York","Schenectady County",2]
[null,null,null,null,null,null,null,null,null,null,null,null,null,"New York","Schoharie County",2]
[null,null,null,null,null,null,null,null,null,null,null,null,null,"New York","Schuyler County",2]
[null,null,null,null,null,null,null,null,null,null,null,null,null,"New York","Seneca County",2]
[null,null,null,null,null,null,null,null,null,null,null,null,null,"New York","St. Lawrence County",2]
[null,null,null,null,null,null,null,null,null,null,null,null,null,"New York","Steuben County",2]
[null,null,null,null,null,null,null,null,null,null,null,null,null,"New York","Suffolk County",3]
[null,null,null,null,null,null,null,null,null,null,null,null,null,"New York","Sullivan County",2]
[null,null,null,null,null,null,null,null,null,null,null,null,null,"New York","Tioga County",2]
[null,null,null,null,null,null,null,null,null,null,null,null,null,"New York","Tompkins County",2]
[null,null,null,null,null,null,null,null,null,null,null,null,null,"New York","Ulster County",2]
[null,null,null,null,null,null,null,null,null,null,null,null,null,"New York","Warren County",3]
[null,null,null,null,null,null,null,null,null,null,null,null,null,"New York","Washington County",2]
[null,null,null,null,null,null,null,null,null,null,null,null,null,"New York","Wayne County",2]
[null,null,null,null,null,null,null,null,null,null,null,null,null,"New York","Westchester County",2]
[null,null,null,null,null,null,null,null,null,null,null,null,null,"New York","Wyoming County",2]
[null,null,null,null,null,null,null,null,null,null,null,null,null,"New York","Yates County",2]
[null,null,null,null,null,null,null,null,null,null,null,null,null,"North Carolina","Alamance County",2]
[null,null,null,null,null,null,null,null,null,null,null,null,null,"North Carolina","Alexander County",3]
[null,null,null,null,null,null,null,null,null,null,null,null,null,"North Carolina","Alleghany County",3]
[null,null,null,null,null,null,null,null,null,null,null,null,null,"North Carolina","Anson County",2]
[null,null,null,null,null,null,null,null,null,null,null,null,null,"North Carolina","Ashe County",3]
[null,null,null,null,null,null,null,null,null,null,null,null,null,"North Carolina","Avery County",3]
[null,null,null,null,null,null,null,null,null,null,null,null,null,"North Carolina","Beaufort County","Not Eligible for Credit"]
[null,null,null,null,null,null,null,null,null,null,null,null,null,"North Carolina","Bertie County","Not Eligible for Credit"]
[null,null,null,null,null,null,null,null,null,null,null,null,null,"North Carolina","Bladen County",2]
[null,null,null,null,null,null,null,null,null,null,null,null,null,"North Carolina","Brunswick County",2]
[null,null,null,null,null,null,null,null,null,null,null,null,null,"North Carolina","Buncombe County",3]
[null,null,null,null,null,null,null,null,null,null,null,null,null,"North Carolina","Burke County",3]
[null,null,null,null,null,null,null,null,null,null,null,null,null,"North Carolina","Cabarrus County",2]
[null,null,null,null,null,null,null,null,null,null,null,null,null,"North Carolina","Caldwell County",2]
[null,null,null,null,null,null,null,null,null,null,null,null,null,"North Carolina","Camden County","Not Eligible for Credit"]
[null,null,null,null,null,null,null,null,null,null,null,null,null,"North Carolina","Carteret County","Not Eligible for Credit"]
[null,null,null,null,null,null,null,null,null,null,null,null,null,"North Carolina","Caswell County",2]
[null,null,null,null,null,null,null,null,null,null,null,null,null,"North Carolina","Catawba County",2]
[null,null,null,null,null,null,null,null,null,null,null,null,null,"North Carolina","Chatham County",2]
[null,null,null,null,null,null,null,null,null,null,null,null,null,"North Carolina","Cherokee County",2]
[null,null,null,null,null,null,null,null,null,null,null,null,null,"North Carolina","Chowan County","Not Eligible for Credit"]
[null,null,null,null,null,null,null,null,null,null,null,null,null,"North Carolina","Clay County",2]
[null,null,null,null,null,null,null,null,null,null,null,null,null,"North Carolina","Cleveland County",2]
[null,null,null,null,null,null,null,null,null,null,null,null,null,"North Carolina","Columbus County",2]
[null,null,null,null,null,null,null,null,null,null,null,null,null,"North Carolina","Craven County","Not Eligible for Credit"]
[null,null,null,null,null,null,null,null,null,null,null,null,null,"North Carolina","Cumberland County",2]
[null,null,null,null,null,null,null,null,null,null,null,null,null,"North Carolina","Currituck County","Not Eligible for Credit"]
[null,null,null,null,null,null,null,null,null,null,null,null,null,"North Carolina","Dare County","Not Eligible for Credit"]
[null,null,null,null,null,null,null,null,null,null,null,null,null,"North Carolina","Davidson County",2]
[null,null,null,null,null,null,null,null,null,null,null,null,null,"North Carolina","Davie County",2]
[null,null,null,null,null,null,null,null,null,null,null,null,null,"North Carolina","Duplin County",2]
[null,null,null,null,null,null,null,null,null,null,null,null,null,"North Carolina","Durham County",2]
[null,null,null,null,null,null,null,null,null,null,null,null,null,"North Carolina","Edgecombe County",2]
[null,null,null,null,null,null,null,null,null,null,null,null,null,"North Carolina","Forsyth County",3]
[null,null,null,null,null,null,null,null,null,null,null,null,null,"North Carolina","Franklin County",2]
[null,null,null,null,null,null,null,null,null,null,null,null,null,"North Carolina","Gaston County",2]
[null,null,null,null,null,null,null,null,null,null,null,null,null,"North Carolina","Gates County","Not Eligible for Credit"]
[null,null,null,null,null,null,null,null,null,null,null,null,null,"North Carolina","Graham County",2]
[null,null,null,null,null,null,null,null,null,null,null,null,null,"North Carolina","Granville County",2]
[null,null,null,null,null,null,null,null,null,null,null,null,null,"North Carolina","Greene County",2]
[null,null,null,null,null,null,null,null,null,null,null,null,null,"North Carolina","Guilford County",2]
[null,null,null,null,null,null,null,null,null,null,null,null,null,"North Carolina","Halifax County",2]
[null,null,null,null,null,null,null,null,null,null,null,null,null,"North Carolina","Harnett County",2]
[null,null,null,null,null,null,null,null,null,null,null,null,null,"North Carolina","Haywood County",3]
[null,null,null,null,null,null,null,null,null,null,null,null,null,"North Carolina","Henderson County",2]
[null,null,null,null,null,null,null,null,null,null,null,null,null,"North Carolina","Hertford County","Not Eligible for Credit"]
[null,null,null,null,null,null,null,null,null,null,null,null,null,"North Carolina","Hoke County",2]
[null,null,null,null,null,null,null,null,null,null,null,null,null,"North Carolina","Hyde County","Not Eligible for Credit"]
[null,null,null,null,null,null,null,null,null,null,null,null,null,"North Carolina","Iredell County",2]
[null,null,null,null,null,null,null,null,null,null,null,null,null,"North Carolina","Jackson County",3]
[null,null,null,null,null,null,null,null,null,null,null,null,null,"North Carolina","Johnston County",2]
[null,null,null,null,null,null,null,null,null,null,null,null,null,"North Carolina","Jones County","Not Eligible for Credit"]
[null,null,null,null,null,null,null,null,null,null,null,null,null,"North Carolina","Lee County",2]
[null,null,null,null,null,null,null,null,null,null,null,null,null,"North Carolina","Lenoir County","Not Eligible for Credit"]
[null,null,null,null,null,null,null,null,null,null,null,null,null,"North Carolina","Lincoln County",2]
[null,null,null,null,null,null,null,null,null,null,null,null,null,"North Carolina","Macon County",2]
[null,null,null,null,null,null,null,null,null,null,null,null,null,"North Carolina","Madison County",3]
[null,null,null,null,null,null,null,null,null,null,null,null,null,"North Carolina","Martin County",2]
[null,null,null,null,null,null,null,null,null,null,null,null,null,"North Carolina","McDowell County",2]
[null,null,null,null,null,null,null,null,null,null,null,null,null,"North Carolina","Mecklenburg County",2]
[null,null,null,null,null,null,null,null,null,null,null,null,null,"North Carolina","Mitchell County",2]
[null,null,null,null,null,null,null,null,null,null,null,null,null,"North Carolina","Montgomery County",2]
[null,null,null,null,null,null,null,null,null,null,null,null,null,"North Carolina","Moore County",2]
[null,null,null,null,null,null,null,null,null,null,null,null,null,"North Carolina","Nash County",2]
[null,null,null,null,null,null,null,null,null,null,null,null,null,"North Carolina","New Hanover County",2]
[null,null,null,null,null,null,null,null,null,null,null,null,null,"North Carolina","Northampton County",2]
[null,null,null,null,null,null,null,null,null,null,null,null,null,"North Carolina","Onslow County",2]
[null,null,null,null,null,null,null,null,null,null,null,null,null,"North Carolina","Orange County","Not Eligible for Credit"]
[null,null,null,null,null,null,null,null,null,null,null,null,null,"North Carolina","Pamlico County","Not Eligible for Credit"]
[null,null,null,null,null,null,null,null,null,null,null,null,null,"North Carolina","Pasquotank County","Not Eligible for Credit"]
[null,null,null,null,null,null,null,null,null,null,null,null,null,"North Carolina","Pender County",2]
[null,null,null,null,null,null,null,null,null,null,null,null,null,"North Carolina","Perquimans County","Not Eligible for Credit"]
[null,null,null,null,null,null,null,null,null,null,null,null,null,"North Carolina","Person County",2]
[null,null,null,null,null,null,null,null,null,null,null,null,null,"North Carolina","Pitt County","Not Eligible for Credit"]
[null,null,null,null,null,null,null,null,null,null,null,null,null,"North Carolina","Polk County",3]
[null,null,null,null,null,null,null,null,null,null,null,null,null,"North Carolina","Randolph County",2]
[null,null,null,null,null,null,null,null,null,null,null,null,null,"North Carolina","Richmond County",2]
[null,null,null,null,null,null,null,null,null,null,null,null,null,"North Carolina","Robeson County",2]
[null,null,null,null,null,null,null,null,null,null,null,null,null,"North Carolina","Rockingham County",2]
[null,null,null,null,null,null,null,null,null,null,null,null,null,"North Carolina","Rowan County",2]
[null,null,null,null,null,null,null,null,null,null,null,null,null,"North Carolina","Rutherford County",2]
[null,null,null,null,null,null,null,null,null,null,null,null,null,"North Carolina","Sampson County",2]
[null,null,null,null,null,null,null,null,null,null,null,null,null,"North Carolina","Scotland County",2]
[null,null,null,null,null,null,null,null,null,null,null,null,null,"North Carolina","Stanly County",2]
[null,null,null,null,null,null,null,null,null,null,null,null,null,"North Carolina","Stokes County",2]
[null,null,null,null,null,null,null,null,null,null,null,null,null,"North Carolina","Surry County",2]
[null,null,null,null,null,null,null,null,null,null,null,null,null,"North Carolina","Swain County",3]
[null,null,null,null,null,null,null,null,null,null,null,null,null,"North Carolina","Transylvania County",2]
[null,null,null,null,null,null,null,null,null,null,null,null,null,"North Carolina","Tyrrell County","Not Eligible for Credit"]
[null,null,null,null,null,null,null,null,null,null,null,null,null,"North Carolina","Union County",2]
[null,null,null,null,null,null,null,null,null,null,null,null,null,"North Carolina","Vance County",2]
[null,null,null,null,null,null,null,null,null,null,null,null,null,"North Carolina","Wake County",2]
[null,null,null,null,null,null,null,null,null,null,null,null,null,"North Carolina","Warren County",2]
[null,null,null,null,null,null,null,null,null,null,null,null,null,"North Carolina","Washington County","Not Eligible for Credit"]
[null,null,null,null,null,null,null,null,null,null,null,null,null,"North Carolina","Watauga County",3]
[null,null,null,null,null,null,null,null,null,null,null,null,null,"North Carolina","Wayne County","Not Eligible for Credit"]
[null,null,null,null,null,null,null,null,null,null,null,null,null,"North Carolina","Wilkes County",3]
[null,null,null,null,null,null,null,null,null,null,null,null,null,"North Carolina","Wilson County",2]
[null,null,null,null,null,null,null,null,null,null,null,null,null,"North Carolina","Yadkin County",2]
[null,null,null,null,null,null,null,null,null,null,null,null,null,"North Carolina","Yancey County",3]
[null,null,null,null,null,null,null,null,null,null,null,null,null,"North Dakota","Adams County",2]
[null,null,null,null,null,null,null,null,null,null,null,null,null,"North Dakota","Barnes County",3]
[null,null,null,null,null,null,null,null,null,null,null,null,null,"North Dakota","Benson County",2]
[null,null,null,null,null,null,null,null,null,null,null,null,null,"North Dakota","Billings County",2]
[null,null,null,null,null,null,null,null,null,null,null,null,null,"North Dakota","Bottineau County",3]
[null,null,null,null,null,null,null,null,null,null,null,null,null,"North Dakota","Bowman County",2]
[null,null,null,null,null,null,null,null,null,null,null,null,null,"North Dakota","Burke County",3]
[null,null,null,null,null,null,null,null,null,null,null,null,null,"North Dakota","Burleigh County",2]
[null,null,null,null,null,null,null,null,null,null,null,null,null,"North Dakota","Cass County",2]
[null,null,null,null,null,null,null,null,null,null,null,null,null,"North Dakota","Cavalier County",2]
[null,null,null,null,null,null,null,null,null,null,null,null,null,"North Dakota","Dickey County",2]
[null,null,null,null,null,null,null,null,null,null,null,null,null,"North Dakota","Divide County",3]
[null,null,null,null,null,null,null,null,null,null,null,null,null,"North Dakota","Dunn County",2]
[null,null,null,null,null,null,null,null,null,null,null,null,null,"North Dakota","Eddy County",2]
[null,null,null,null,null,null,null,null,null,null,null,null,null,"North Dakota","Emmons County",2]
[null,null,null,null,null,null,null,null,null,null,null,null,null,"North Dakota","Foster County",2]
[null,null,null,null,null,null,null,null,null,null,null,null,null,"North Dakota","Golden Valley County",3]
[null,null,null,null,null,null,null,null,null,null,null,null,null,"North Dakota","Grand Forks County",2]
[null,null,null,null,null,null,null,null,null,null,null,null,null,"North Dakota","Grant County",2]
[null,null,null,null,null,null,null,null,null,null,null,null,null,"North Dakota","Griggs County",2]
[null,null,null,null,null,null,null,null,null,null,null,null,null,"North Dakota","Hettinger County",2]
[null,null,null,null,null,null,null,null,null,null,null,null,null,"North Dakota","Kidder County",2]
[null,null,null,null,null,null,null,null,null,null,null,null,null,"North Dakota","LaMoure County",2]
[null,null,null,null,null,null,null,null,null,null,null,null,null,"North Dakota","Logan County",2]
[null,null,null,null,null,null,null,null,null,null,null,null,null,"North Dakota","McHenry County",3]
[null,null,null,null,null,null,null,null,null,null,null,null,null,"North Dakota","McIntosh County",2]
[null,null,null,null,null,null,null,null,null,null,null,null,null,"North Dakota","McKenzie County",2]
[null,null,null,null,null,null,null,null,null,null,null,null,null,"North Dakota","McLean County",2]
[null,null,null,null,null,null,null,null,null,null,null,null,null,"North Dakota","Mercer County",2]
[null,null,null,null,null,null,null,null,null,null,null,null,null,"North Dakota","Morton County",2]
[null,null,null,null,null,null,null,null,null,null,null,null,null,"North Dakota","Mountrail County",2]
[null,null,null,null,null,null,null,null,null,null,null,null,null,"North Dakota","Nelson County",3]
[null,null,null,null,null,null,null,null,null,null,null,null,null,"North Dakota","Oliver County",2]
[null,null,null,null,null,null,null,null,null,null,null,null,null,"North Dakota","Pembina County",2]
[null,null,null,null,null,null,null,null,null,null,null,null,null,"North Dakota","Pierce County",3]
[null,null,null,null,null,null,null,null,null,null,null,null,null,"North Dakota","Ramsey County",3]
[null,null,null,null,null,null,null,null,null,null,null,null,null,"North Dakota","Ransom County",2]
[null,null,null,null,null,null,null,null,null,null,null,null,null,"North Dakota","Renville County",3]
[null,null,null,null,null,null,null,null,null,null,null,null,null,"North Dakota","Richland County",2]
[null,null,null,null,null,null,null,null,null,null,null,null,null,"North Dakota","Rolette County",3]
[null,null,null,null,null,null,null,null,null,null,null,null,null,"North Dakota","Sargent County",2]
[null,null,null,null,null,null,null,null,null,null,null,null,null,"North Dakota","Sheridan County",2]
[null,null,null,null,null,null,null,null,null,null,null,null,null,"North Dakota","Sioux County",2]
[null,null,null,null,null,null,null,null,null,null,null,null,null,"North Dakota","Slope County",2]
[null,null,null,null,null,null,null,null,null,null,null,null,null,"North Dakota","Stark County",2]
[null,null,null,null,null,null,null,null,null,null,null,null,null,"North Dakota","Steele County",2]
[null,null,null,null,null,null,null,null,null,null,null,null,null,"North Dakota","Stutsman County",3]
[null,null,null,null,null,null,null,null,null,null,null,null,null,"North Dakota","Towner County",3]
[null,null,null,null,null,null,null,null,null,null,null,null,null,"North Dakota","Traill County",2]
[null,null,null,null,null,null,null,null,null,null,null,null,null,"North Dakota","Walsh County",2]
[null,null,null,null,null,null,null,null,null,null,null,null,null,"North Dakota","Ward County",3]
[null,null,null,null,null,null,null,null,null,null,null,null,null,"North Dakota","Wells County",2]
[null,null,null,null,null,null,null,null,null,null,null,null,null,"North Dakota","Williams County",3]
[null,null,null,null,null,null,null,null,null,null,null,null,null,"Ohio","Adams County",2]
[null,null,null,null,null,null,null,null,null,null,null,null,null,"Ohio","Allen County",2]
[null,null,null,null,null,null,null,null,null,null,null,null,null,"Ohio","Ashland County",2]
[null,null,null,null,null,null,null,null,null,null,null,null,null,"Ohio","Ashtabula County",2]
[null,null,null,null,null,null,null,null,null,null,null,null,null,"Ohio","Athens County",2]
[null,null,null,null,null,null,null,null,null,null,null,null,null,"Ohio","Auglaize County",2]
[null,null,null,null,null,null,null,null,null,null,null,null,null,"Ohio","Belmont County",2]
[null,null,null,null,null,null,null,null,null,null,null,null,null,"Ohio","Brown County",2]
[null,null,null,null,null,null,null,null,null,null,null,null,null,"Ohio","Butler County",2]
[null,null,null,null,null,null,null,null,null,null,null,null,null,"Ohio","Carroll County",3]
[null,null,null,null,null,null,null,null,null,null,null,null,null,"Ohio","Champaign County",3]
[null,null,null,null,null,null,null,null,null,null,null,null,null,"Ohio","Clark County",3]
[null,null,null,null,null,null,null,null,null,null,null,null,null,"Ohio","Clermont County",2]
[null,null,null,null,null,null,null,null,null,null,null,null,null,"Ohio","Clinton County",2]
[null,null,null,null,null,null,null,null,null,null,null,null,null,"Ohio","Columbiana County",2]
[null,null,null,null,null,null,null,null,null,null,null,null,null,"Ohio","Coshocton County",3]
[null,null,null,null,null,null,null,null,null,null,null,null,null,"Ohio","Crawford County",2]
[null,null,null,null,null,null,null,null,null,null,null,null,null,"Ohio","Cuyahoga County",2]
[null,null,null,null,null,null,null,null,null,null,null,null,null,"Ohio","Darke County",2]
[null,null,null,null,null,null,null,null,null,null,null,null,null,"Ohio","Defiance County",2]
[null,null,null,null,null,null,null,null,null,null,null,null,null,"Ohio","Delaware County",2]
[null,null,null,null,null,null,null,null,null,null,null,null,null,"Ohio","Erie County",2]
[null,null,null,null,null,null,null,null,null,null,null,null,null,"Ohio","Fairfield County",3]
[null,null,null,null,null,null,null,null,null,null,null,null,null,"Ohio","Fayette County",3]
[null,null,null,null,null,null,null,null,null,null,null,null,null,"Ohio","Franklin County",3]
[null,null,null,null,null,null,null,null,null,null,null,null,null,"Ohio","Fulton County",2]
[null,null,null,null,null,null,null,null,null,null,null,null,null,"Ohio","Gallia County",2]
[null,null,null,null,null,null,null,null,null,null,null,null,null,"Ohio","Geauga County",2]
[null,null,null,null,null,null,null,null,null,null,null,null,null,"Ohio","Greene County",2]
[null,null,null,null,null,null,null,null,null,null,null,null,null,"Ohio","Guernsey County",3]
[null,null,null,null,null,null,null,null,null,null,null,null,null,"Ohio","Hamilton County",2]
[null,null,null,null,null,null,null,null,null,null,null,null,null,"Ohio","Hancock County",2]
[null,null,null,null,null,null,null,null,null,null,null,null,null,"Ohio","Hardin County",2]
[null,null,null,null,null,null,null,null,null,null,null,null,null,"Ohio","Harrison County",2]
[null,null,null,null,null,null,null,null,null,null,null,null,null,"Ohio","Henry County",2]
[null,null,null,null,null,null,null,null,null,null,null,null,null,"Ohio","Highland County",2]
[null,null,null,null,null,null,null,null,null,null,null,null,null,"Ohio","Hocking County",3]
[null,null,null,null,null,null,null,null,null,null,null,null,null,"Ohio","Holmes County",2]
[null,null,null,null,null,null,null,null,null,null,null,null,null,"Ohio","Huron County",2]
[null,null,null,null,null,null,null,null,null,null,null,null,null,"Ohio","Jackson County",2]
[null,null,null,null,null,null,null,null,null,null,null,null,null,"Ohio","Jefferson County",2]
[null,null,null,null,null,null,null,null,null,null,null,null,null,"Ohio","Knox County",2]
[null,null,null,null,null,null,null,null,null,null,null,null,null,"Ohio","Lake County",2]
[null,null,null,null,null,null,null,null,null,null,null,null,null,"Ohio","Lawrence County",2]
[null,null,null,null,null,null,null,null,null,null,null,null,null,"Ohio","Licking County",3]
[null,null,null,null,null,null,null,null,null,null,null,null,null,"Ohio","Logan County",2]
[null,null,null,null,null,null,null,null,null,null,null,null,null,"Ohio","Lorain County",2]
[null,null,null,null,null,null,null,null,null,null,null,null,null,"Ohio","Lucas County",2]
[null,null,null,null,null,null,null,null,null,null,null,null,null,"Ohio","Madison County",3]
[null,null,null,null,null,null,null,null,null,null,null,null,null,"Ohio","Mahoning County",2]
[null,null,null,null,null,null,null,null,null,null,null,null,null,"Ohio","Marion County",2]
[null,null,null,null,null,null,null,null,null,null,null,null,null,"Ohio","Medina County",2]
[null,null,null,null,null,null,null,null,null,null,null,null,null,"Ohio","Meigs County",2]
[null,null,null,null,null,null,null,null,null,null,null,null,null,"Ohio","Mercer County",2]
[null,null,null,null,null,null,null,null,null,null,null,null,null,"Ohio","Miami County",2]
[null,null,null,null,null,null,null,null,null,null,null,null,null,"Ohio","Monroe County",3]
[null,null,null,null,null,null,null,null,null,null,null,null,null,"Ohio","Montgomery County",3]
[null,null,null,null,null,null,null,null,null,null,null,null,null,"Ohio","Morgan County",2]
[null,null,null,null,null,null,null,null,null,null,null,null,null,"Ohio","Morrow County",2]
[null,null,null,null,null,null,null,null,null,null,null,null,null,"Ohio","Muskingum County",3]
[null,null,null,null,null,null,null,null,null,null,null,null,null,"Ohio","Noble County",3]
[null,null,null,null,null,null,null,null,null,null,null,null,null,"Ohio","Ottawa County",2]
[null,null,null,null,null,null,null,null,null,null,null,null,null,"Ohio","Paulding County",2]
[null,null,null,null,null,null,null,null,null,null,null,null,null,"Ohio","Perry County",3]
[null,null,null,null,null,null,null,null,null,null,null,null,null,"Ohio","Pickaway County",3]
[null,null,null,null,null,null,null,null,null,null,null,null,null,"Ohio","Pike County",2]
[null,null,null,null,null,null,null,null,null,null,null,null,null,"Ohio","Portage County",2]
[null,null,null,null,null,null,null,null,null,null,null,null,null,"Ohio","Preble County",2]
[null,null,null,null,null,null,null,null,null,null,null,null,null,"Ohio","Putnam County",2]
[null,null,null,null,null,null,null,null,null,null,null,null,null,"Ohio","Richland County",2]
[null,null,null,null,null,null,null,null,null,null,null,null,null,"Ohio","Ross County",3]
[null,null,null,null,null,null,null,null,null,null,null,null,null,"Ohio","Sandusky County",2]
[null,null,null,null,null,null,null,null,null,null,null,null,null,"Ohio","Scioto County",3]
[null,null,null,null,null,null,null,null,null,null,null,null,null,"Ohio","Seneca County",2]
[null,null,null,null,null,null,null,null,null,null,null,null,null,"Ohio","Shelby County",2]
[null,null,null,null,null,null,null,null,null,null,null,null,null,"Ohio","Stark County",2]
[null,null,null,null,null,null,null,null,null,null,null,null,null,"Ohio","Summit County",2]
[null,null,null,null,null,null,null,null,null,null,null,null,null,"Ohio","Trumbull County",2]
[null,null,null,null,null,null,null,null,null,null,null,null,null,"Ohio","Tuscarawas County",3]
[null,null,null,null,null,null,null,null,null,null,null,null,null,"Ohio","Union County",2]
[null,null,null,null,null,null,null,null,null,null,null,null,null,"Ohio","Van Wert County",2]
[null,null,null,null,null,null,null,null,null,null,null,null,null,"Ohio","Vinton County",2]
[null,null,null,null,null,null,null,null,null,null,null,null,null,"Ohio","Warren County",3]
[null,null,null,null,null,null,null,null,null,null,null,null,null,"Ohio","Washington County",2]
[null,null,null,null,null,null,null,null,null,null,null,null,null,"Ohio","Wayne County",2]
[null,null,null,null,null,null,null,null,null,null,null,null,null,"Ohio","Williams County",2]
[null,null,null,null,null,null,null,null,null,null,null,null,null,"Ohio","Wood County",2]
[null,null,null,null,null,null,null,null,null,null,null,null,null,"Ohio","Wyandot County",2]
[null,null,null,null,null,null,null,null,null,null,null,null,null,"Oklahoma","Adair County",2]
[null,null,null,null,null,null,null,null,null,null,null,null,null,"Oklahoma","Alfalfa County",2]
[null,null,null,null,null,null,null,null,null,null,null,null,null,"Oklahoma","Atoka County","Not Eligible for Credit"]
[null,null,null,null,null,null,null,null,null,null,null,null,null,"Oklahoma","Beaver County",3]
[null,null,null,null,null,null,null,null,null,null,null,null,null,"Oklahoma","Beckham County",2]
[null,null,null,null,null,null,null,null,null,null,null,null,null,"Oklahoma","Blaine County",2]
[null,null,null,null,null,null,null,null,null,null,null,null,null,"Oklahoma","Bryan County","Not Eligible for Credit"]
[null,null,null,null,null,null,null,null,null,null,null,null,null,"Oklahoma","Caddo County",2]
[null,null,null,null,null,null,null,null,null,null,null,null,null,"Oklahoma","Canadian County",2]
[null,null,null,null,null,null,null,null,null,null,null,null,null,"Oklahoma","Carter County","Not Eligible for Credit"]
[null,null,null,null,null,null,null,null,null,null,null,null,null,"Oklahoma","Cherokee County","Not Eligible for Credit"]
[null,null,null,null,null,null,null,null,null,null,null,null,null,"Oklahoma","Choctaw County","Not Eligible for Credit"]
[null,null,null,null,null,null,null,null,null,null,null,null,null,"Oklahoma","Cimarron County",3]
[null,null,null,null,null,null,null,null,null,null,null,null,null,"Oklahoma","Cleveland County",2]
[null,null,null,null,null,null,null,null,null,null,null,null,null,"Oklahoma","Coal County",2]
[null,null,null,null,null,null,null,null,null,null,null,null,null,"Oklahoma","Comanche County",2]
[null,null,null,null,null,null,null,null,null,null,null,null,null,"Oklahoma","Cotton County",2]
[null,null,null,null,null,null,null,null,null,null,null,null,null,"Oklahoma","Craig County","Not Eligible for Credit"]
[null,null,null,null,null,null,null,null,null,null,null,null,null,"Oklahoma","Creek County",2]
[null,null,null,null,null,null,null,null,null,null,null,null,null,"Oklahoma","Custer County",2]
[null,null,null,null,null,null,null,null,null,null,null,null,null,"Oklahoma","Delaware County","Not Eligible for Credit"]
[null,null,null,null,null,null,null,null,null,null,null,null,null,"Oklahoma","Dewey County",2]
[null,null,null,null,null,null,null,null,null,null,null,null,null,"Oklahoma","Ellis County",3]
[null,null,null,null,null,null,null,null,null,null,null,null,null,"Oklahoma","Garfield County","Not Eligible for Credit"]
[null,null,null,null,null,null,null,null,null,null,null,null,null,"Oklahoma","Garvin County",2]
[null,null,null,null,null,null,null,null,null,null,null,null,null,"Oklahoma","Grady County",2]
[null,null,null,null,null,null,null,null,null,null,null,null,null,"Oklahoma","Grant County",2]
[null,null,null,null,null,null,null,null,null,null,null,null,null,"Oklahoma","Greer County",2]
[null,null,null,null,null,null,null,null,null,null,null,null,null,"Oklahoma","Harmon County",2]
[null,null,null,null,null,null,null,null,null,null,null,null,null,"Oklahoma","Harper County",3]
[null,null,null,null,null,null,null,null,null,null,null,null,null,"Oklahoma","Haskell County","Not Eligible for Credit"]
[null,null,null,null,null,null,null,null,null,null,null,null,null,"Oklahoma","Hughes County","Not Eligible for Credit"]
[null,null,null,null,null,null,null,null,null,null,null,null,null,"Oklahoma","Jackson County",2]
[null,null,null,null,null,null,null,null,null,null,null,null,null,"Oklahoma","Jefferson County",2]
[null,null,null,null,null,null,null,null,null,null,null,null,null,"Oklahoma","Johnston County","Not Eligible for Credit"]
[null,null,null,null,null,null,null,null,null,null,null,null,null,"Oklahoma","Kay County","Not Eligible for Credit"]
[null,null,null,null,null,null,null,null,null,null,null,null,null,"Oklahoma","Kingfisher County",2]
[null,null,null,null,null,null,null,null,null,null,null,null,null,"Oklahoma","Kiowa County",2]
[null,null,null,null,null,null,null,null,null,null,null,null,null,"Oklahoma","Latimer County","Not Eligible for Credit"]
[null,null,null,null,null,null,null,null,null,null,null,null,null,"Oklahoma","Le Flore County","Not Eligible for Credit"]
[null,null,null,null,null,null,null,null,null,null,null,null,null,"Oklahoma","Lincoln County",2]
[null,null,null,null,null,null,null,null,null,null,null,null,null,"Oklahoma","Logan County",2]
[null,null,null,null,null,null,null,null,null,null,null,null,null,"Oklahoma","Love County",2]
[null,null,null,null,null,null,null,null,null,null,null,null,null,"Oklahoma","Major County",2]
[null,null,null,null,null,null,null,null,null,null,null,null,null,"Oklahoma","Marshall County","Not Eligible for Credit"]
[null,null,null,null,null,null,null,null,null,null,null,null,null,"Oklahoma","Mayes County","Not Eligible for Credit"]
[null,null,null,null,null,null,null,null,null,null,null,null,null,"Oklahoma","McClain County",2]
[null,null,null,null,null,null,null,null,null,null,null,null,null,"Oklahoma","McCurtain County","Not Eligible for Credit"]
[null,null,null,null,null,null,null,null,null,null,null,null,null,"Oklahoma","McIntosh County","Not Eligible for Credit"]
[null,null,null,null,null,null,null,null,null,null,null,null,null,"Oklahoma","Murray County",2]
[null,null,null,null,null,null,null,null,null,null,null,null,null,"Oklahoma","Muskogee County","Not Eligible for Credit"]
[null,null,null,null,null,null,null,null,null,null,null,null,null,"Oklahoma","Noble County","Not Eligible for Credit"]
[null,null,null,null,null,null,null,null,null,null,null,null,null,"Oklahoma","Nowata County","Not Eligible for Credit"]
[null,null,null,null,null,null,null,null,null,null,null,null,null,"Oklahoma","Okfuskee County","Not Eligible for Credit"]
[null,null,null,null,null,null,null,null,null,null,null,null,null,"Oklahoma","Oklahoma County",2]
[null,null,null,null,null,null,null,null,null,null,null,null,null,"Oklahoma","Okmulgee County","Not Eligible for Credit"]
[null,null,null,null,null,null,null,null,null,null,null,null,null,"Oklahoma","Osage County","Not Eligible for Credit"]
[null,null,null,null,null,null,null,null,null,null,null,null,null,"Oklahoma","Ottawa County","Not Eligible for Credit"]
[null,null,null,null,null,null,null,null,null,null,null,null,null,"Oklahoma","Pawnee County",2]
[null,null,null,null,null,null,null,null,null,null,null,null,null,"Oklahoma","Payne County",2]
[null,null,null,null,null,null,null,null,null,null,null,null,null,"Oklahoma","Pittsburg County","Not Eligible for Credit"]
[null,null,null,null,null,null,null,null,null,null,null,null,null,"Oklahoma","Pontotoc County","Not Eligible for Credit"]
[null,null,null,null,null,null,null,null,null,null,null,null,null,"Oklahoma","Pottawatomie County",2]
[null,null,null,null,null,null,null,null,null,null,null,null,null,"Oklahoma","Pushmataha County",2]
[null,null,null,null,null,null,null,null,null,null,null,null,null,"Oklahoma","Roger Mills County",3]
[null,null,null,null,null,null,null,null,null,null,null,null,null,"Oklahoma","Rogers County","Not Eligible for Credit"]
[null,null,null,null,null,null,null,null,null,null,null,null,null,"Oklahoma","Seminole County",2]
[null,null,null,null,null,null,null,null,null,null,null,null,null,"Oklahoma","Sequoyah County",2]
[null,null,null,null,null,null,null,null,null,null,null,null,null,"Oklahoma","Stephens County",2]
[null,null,null,null,null,null,null,null,null,null,null,null,null,"Oklahoma","Texas County",3]
[null,null,null,null,null,null,null,null,null,null,null,null,null,"Oklahoma","Tillman County",2]
[null,null,null,null,null,null,null,null,null,null,null,null,null,"Oklahoma","Tulsa County","Not Eligible for Credit"]
[null,null,null,null,null,null,null,null,null,null,null,null,null,"Oklahoma","Wagoner County","Not Eligible for Credit"]
[null,null,null,null,null,null,null,null,null,null,null,null,null,"Oklahoma","Washington County","Not Eligible for Credit"]
[null,null,null,null,null,null,null,null,null,null,null,null,null,"Oklahoma","Washita County",2]
[null,null,null,null,null,null,null,null,null,null,null,null,null,"Oklahoma","Woods County",2]
[null,null,null,null,null,null,null,null,null,null,null,null,null,"Oklahoma","Woodward County",2]
[null,null,null,null,null,null,null,null,null,null,null,null,null,"Oregon","Baker County",3]
[null,null,null,null,null,null,null,null,null,null,null,null,null,"Oregon","Benton County",2]
[null,null,null,null,null,null,null,null,null,null,null,null,null,"Oregon","Clackamas County",3]
[null,null,null,null,null,null,null,null,null,null,null,null,null,"Oregon","Clatsop County",3]
[null,null,null,null,null,null,null,null,null,null,null,null,null,"Oregon","Columbia County",3]
[null,null,null,null,null,null,null,null,null,null,null,null,null,"Oregon","Coos County",3]
[null,null,null,null,null,null,null,null,null,null,null,null,null,"Oregon","Crook County",6]
[null,null,null,null,null,null,null,null,null,null,null,null,null,"Oregon","Curry County",2]
[null,null,null,null,null,null,null,null,null,null,null,null,null,"Oregon","Deschutes County",6]
[null,null,null,null,null,null,null,null,null,null,null,null,null,"Oregon","Douglas County",3]
[null,null,null,null,null,null,null,null,null,null,null,null,null,"Oregon","Gilliam County",6]
[null,null,null,null,null,null,null,null,null,null,null,null,null,"Oregon","Grant County",3]
[null,null,null,null,null,null,null,null,null,null,null,null,null,"Oregon","Harney County",6]
[null,null,null,null,null,null,null,null,null,null,null,null,null,"Oregon","Hood River County",3]
[null,null,null,null,null,null,null,null,null,null,null,null,null,"Oregon","Jackson County",3]
[null,null,null,null,null,null,null,null,null,null,null,null,null,"Oregon","Jefferson County",3]
[null,null,null,null,null,null,null,null,null,null,null,null,null,"Oregon","Josephine County",3]
[null,null,null,null,null,null,null,null,null,null,null,null,null,"Oregon","Klamath County",6]
[null,null,null,null,null,null,null,null,null,null,null,null,null,"Oregon","Lake County",3]
[null,null,null,null,null,null,null,null,null,null,null,null,null,"Oregon","Lane County",3]
[null,null,null,null,null,null,null,null,null,null,null,null,null,"Oregon","Lincoln County",2]
[null,null,null,null,null,null,null,null,null,null,null,null,null,"Oregon","Linn County",3]
[null,null,null,null,null,null,null,null,null,null,null,null,null,"Oregon","Malheur County",6]
[null,null,null,null,null,null,null,null,null,null,null,null,null,"Oregon","Marion County",3]
[null,null,null,null,null,null,null,null,null,null,null,null,null,"Oregon","Morrow County",3]
[null,null,null,null,null,null,null,null,null,null,null,null,null,"Oregon","Multnomah County",3]
[null,null,null,null,null,null,null,null,null,null,null,null,null,"Oregon","Polk County",2]
[null,null,null,null,null,null,null,null,null,null,null,null,null,"Oregon","Sherman County",6]
[null,null,null,null,null,null,null,null,null,null,null,null,null,"Oregon","Tillamook County",3]
[null,null,null,null,null,null,null,null,null,null,null,null,null,"Oregon","Umatilla County",3]
[null,null,null,null,null,null,null,null,null,null,null,null,null,"Oregon","Union County",3]
[null,null,null,null,null,null,null,null,null,null,null,null,null,"Oregon","Wallowa County",3]
[null,null,null,null,null,null,null,null,null,null,null,null,null,"Oregon","Wasco County",6]
[null,null,null,null,null,null,null,null,null,null,null,null,null,"Oregon","Washington County",3]
[null,null,null,null,null,null,null,null,null,null,null,null,null,"Oregon","Wheeler County",3]
[null,null,null,null,null,null,null,null,null,null,null,null,null,"Oregon","Yamhill County",3]
[null,null,null,null,null,null,null,null,null,null,null,null,null,"Pennsylvania","Adams County",2]
[null,null,null,null,null,null,null,null,null,null,null,null,null,"Pennsylvania","Allegheny County",3]
[null,null,null,null,null,null,null,null,null,null,null,null,null,"Pennsylvania","Armstrong County",2]
[null,null,null,null,null,null,null,null,null,null,null,null,null,"Pennsylvania","Beaver County",3]
[null,null,null,null,null,null,null,null,null,null,null,null,null,"Pennsylvania","Bedford County",2]
[null,null,null,null,null,null,null,null,null,null,null,null,null,"Pennsylvania","Berks County","Not Eligible for Credit"]
[null,null,null,null,null,null,null,null,null,null,null,null,null,"Pennsylvania","Blair County",2]
[null,null,null,null,null,null,null,null,null,null,null,null,null,"Pennsylvania","Bradford County",2]
[null,null,null,null,null,null,null,null,null,null,null,null,null,"Pennsylvania","Bucks County","Not Eligible for Credit"]
[null,null,null,null,null,null,null,null,null,null,null,null,null,"Pennsylvania","Butler County",2]
[null,null,null,null,null,null,null,null,null,null,null,null,null,"Pennsylvania","Cambria County",2]
[null,null,null,null,null,null,null,null,null,null,null,null,null,"Pennsylvania","Cameron County",2]
[null,null,null,null,null,null,null,null,null,null,null,null,null,"Pennsylvania","Carbon County","Not Eligible for Credit"]
[null,null,null,null,null,null,null,null,null,null,null,null,null,"Pennsylvania","Centre County",2]
[null,null,null,null,null,null,null,null,null,null,null,null,null,"Pennsylvania","Chester County",2]
[null,null,null,null,null,null,null,null,null,null,null,null,null,"Pennsylvania","Clarion County",2]
[null,null,null,null,null,null,null,null,null,null,null,null,null,"Pennsylvania","Clearfield County",2]
[null,null,null,null,null,null,null,null,null,null,null,null,null,"Pennsylvania","Clinton County",2]
[null,null,null,null,null,null,null,null,null,null,null,null,null,"Pennsylvania","Columbia County",2]
[null,null,null,null,null,null,null,null,null,null,null,null,null,"Pennsylvania","Crawford County",2]
[null,null,null,null,null,null,null,null,null,null,null,null,null,"Pennsylvania","Cumberland County",2]
[null,null,null,null,null,null,null,null,null,null,null,null,null,"Pennsylvania","Dauphin County",2]
[null,null,null,null,null,null,null,null,null,null,null,null,null,"Pennsylvania","Delaware County","Not Eligible for Credit"]
[null,null,null,null,null,null,null,null,null,null,null,null,null,"Pennsylvania","Elk County",2]
[null,null,null,null,null,null,null,null,null,null,null,null,null,"Pennsylvania","Erie County",2]
[null,null,null,null,null,null,null,null,null,null,null,null,null,"Pennsylvania","Fayette County",2]
[null,null,null,null,null,null,null,null,null,null,null,null,null,"Pennsylvania","Forest County",2]
[null,null,null,null,null,null,null,null,null,null,null,null,null,"Pennsylvania","Franklin County",2]
[null,null,null,null,null,null,null,null,null,null,null,null,null,"Pennsylvania","Fulton County",2]
[null,null,null,null,null,null,null,null,null,null,null,null,null,"Pennsylvania","Greene County",3]
[null,null,null,null,null,null,null,null,null,null,null,null,null,"Pennsylvania","Huntingdon County",2]
[null,null,null,null,null,null,null,null,null,null,null,null,null,"Pennsylvania","Indiana County",2]
[null,null,null,null,null,null,null,null,null,null,null,null,null,"Pennsylvania","Jefferson County",2]
[null,null,null,null,null,null,null,null,null,null,null,null,null,"Pennsylvania","Juniata County",2]
[null,null,null,null,null,null,null,null,null,null,null,null,null,"Pennsylvania","Lackawanna County",2]
[null,null,null,null,null,null,null,null,null,null,null,null,null,"Pennsylvania","Lancaster County",2]
[null,null,null,null,null,null,null,null,null,null,null,null,null,"Pennsylvania","Lawrence County",2]
[null,null,null,null,null,null,null,null,null,null,null,null,null,"Pennsylvania","Lebanon County","Not Eligible for Credit"]
[null,null,null,null,null,null,null,null,null,null,null,null,null,"Pennsylvania","Lehigh County",2]
[null,null,null,null,null,null,null,null,null,null,null,null,null,"Pennsylvania","Luzerne County",2]
[null,null,null,null,null,null,null,null,null,null,null,null,null,"Pennsylvania","Lycoming County",2]
[null,null,null,null,null,null,null,null,null,null,null,null,null,"Pennsylvania","McKean County",2]
[null,null,null,null,null,null,null,null,null,null,null,null,null,"Pennsylvania","Mercer County",2]
[null,null,null,null,null,null,null,null,null,null,null,null,null,"Pennsylvania","Mifflin County",2]
[null,null,null,null,null,null,null,null,null,null,null,null,null,"Pennsylvania","Monroe County",2]
[null,null,null,null,null,null,null,null,null,null,null,null,null,"Pennsylvania","Montgomery County",2]
[null,null,null,null,null,null,null,null,null,null,null,null,null,"Pennsylvania","Montour County",2]
[null,null,null,null,null,null,null,null,null,null,null,null,null,"Pennsylvania","Northampton County","Not Eligible for Credit"]
[null,null,null,null,null,null,null,null,null,null,null,null,null,"Pennsylvania","Northumberland County",2]
[null,null,null,null,null,null,null,null,null,null,null,null,null,"Pennsylvania","Perry County",2]
[null,null,null,null,null,null,null,null,null,null,null,null,null,"Pennsylvania","Philadelphia County","Not Eligible for Credit"]
[null,null,null,null,null,null,null,null,null,null,null,null,null,"Pennsylvania","Pike County",2]
[null,null,null,null,null,null,null,null,null,null,null,null,null,"Pennsylvania","Potter County",2]
[null,null,null,null,null,null,null,null,null,null,null,null,null,"Pennsylvania","Schuylkill County",2]
[null,null,null,null,null,null,null,null,null,null,null,null,null,"Pennsylvania","Snyder County",2]
[null,null,null,null,null,null,null,null,null,null,null,null,null,"Pennsylvania","Somerset County",2]
[null,null,null,null,null,null,null,null,null,null,null,null,null,"Pennsylvania","Sullivan County",2]
[null,null,null,null,null,null,null,null,null,null,null,null,null,"Pennsylvania","Susquehanna County",2]
[null,null,null,null,null,null,null,null,null,null,null,null,null,"Pennsylvania","Tioga County",2]
[null,null,null,null,null,null,null,null,null,null,null,null,null,"Pennsylvania","Union County",2]
[null,null,null,null,null,null,null,null,null,null,null,null,null,"Pennsylvania","Venango County",3]
[null,null,null,null,null,null,null,null,null,null,null,null,null,"Pennsylvania","Warren County",2]
[null,null,null,null,null,null,null,null,null,null,null,null,null,"Pennsylvania","Washington County",2]
[null,null,null,null,null,null,null,null,null,null,null,null,null,"Pennsylvania","Wayne County",2]
[null,null,null,null,null,null,null,null,null,null,null,null,null,"Pennsylvania","Westmoreland County",2]
[null,null,null,null,null,null,null,null,null,null,null,null,null,"Pennsylvania","Wyoming County",2]
[null,null,null,null,null,null,null,null,null,null,null,null,null,"Pennsylvania","York County",2]
[null,null,null,null,null,null,null,null,null,null,null,null,null,"Rhode Island","Bristol County","Not Eligible for Credit"]
[null,null,null,null,null,null,null,null,null,null,null,null,null,"Rhode Island","Kent County","Not Eligible for Credit"]
[null,null,null,null,null,null,null,null,null,null,null,null,null,"Rhode Island","Newport County","Not Eligible for Credit"]
[null,null,null,null,null,null,null,null,null,null,null,null,null,"Rhode Island","Providence County",2]
[null,null,null,null,null,null,null,null,null,null,null,null,null,"Rhode Island","Washington County",2]
[null,null,null,null,null,null,null,null,null,null,null,null,null,"South Carolina","Abbeville County",2]
[null,null,null,null,null,null,null,null,null,null,null,null,null,"South Carolina","Aiken County",2]
[null,null,null,null,null,null,null,null,null,null,null,null,null,"South Carolina","Allendale County",2]
[null,null,null,null,null,null,null,null,null,null,null,null,null,"South Carolina","Anderson County",3]
[null,null,null,null,null,null,null,null,null,null,null,null,null,"South Carolina","Bamberg County",2]
[null,null,null,null,null,null,null,null,null,null,null,null,null,"South Carolina","Barnwell County",2]
[null,null,null,null,null,null,null,null,null,null,null,null,null,"South Carolina","Beaufort County",2]
[null,null,null,null,null,null,null,null,null,null,null,null,null,"South Carolina","Berkeley County",2]
[null,null,null,null,null,null,null,null,null,null,null,null,null,"South Carolina","Calhoun County",2]
[null,null,null,null,null,null,null,null,null,null,null,null,null,"South Carolina","Charleston County",2]
[null,null,null,null,null,null,null,null,null,null,null,null,null,"South Carolina","Cherokee County",2]
[null,null,null,null,null,null,null,null,null,null,null,null,null,"South Carolina","Chester County",2]
[null,null,null,null,null,null,null,null,null,null,null,null,null,"South Carolina","Chesterfield County",2]
[null,null,null,null,null,null,null,null,null,null,null,null,null,"South Carolina","Clarendon County",2]
[null,null,null,null,null,null,null,null,null,null,null,null,null,"South Carolina","Colleton County",2]
[null,null,null,null,null,null,null,null,null,null,null,null,null,"South Carolina","Darlington County",2]
[null,null,null,null,null,null,null,null,null,null,null,null,null,"South Carolina","Dillon County","Not Eligible for Credit"]
[null,null,null,null,null,null,null,null,null,null,null,null,null,"South Carolina","Dorchester County",2]
[null,null,null,null,null,null,null,null,null,null,null,null,null,"South Carolina","Edgefield County",2]
[null,null,null,null,null,null,null,null,null,null,null,null,null,"South Carolina","Fairfield County",3]
[null,null,null,null,null,null,null,null,null,null,null,null,null,"South Carolina","Florence County",2]
[null,null,null,null,null,null,null,null,null,null,null,null,null,"South Carolina","Georgetown County",2]
[null,null,null,null,null,null,null,null,null,null,null,null,null,"South Carolina","Greenville County",3]
[null,null,null,null,null,null,null,null,null,null,null,null,null,"South Carolina","Greenwood County",2]
[null,null,null,null,null,null,null,null,null,null,null,null,null,"South Carolina","Hampton County","Not Eligible for Credit"]
[null,null,null,null,null,null,null,null,null,null,null,null,null,"South Carolina","Horry County","Not Eligible for Credit"]
[null,null,null,null,null,null,null,null,null,null,null,null,null,"South Carolina","Jasper County","Not Eligible for Credit"]
[null,null,null,null,null,null,null,null,null,null,null,null,null,"South Carolina","Kershaw County",2]
[null,null,null,null,null,null,null,null,null,null,null,null,null,"South Carolina","Lancaster County",2]
[null,null,null,null,null,null,null,null,null,null,null,null,null,"South Carolina","Laurens County",2]
[null,null,null,null,null,null,null,null,null,null,null,null,null,"South Carolina","Lee County",2]
[null,null,null,null,null,null,null,null,null,null,null,null,null,"South Carolina","Lexington County",2]
[null,null,null,null,null,null,null,null,null,null,null,null,null,"South Carolina","Marion County","Not Eligible for Credit"]
[null,null,null,null,null,null,null,null,null,null,null,null,null,"South Carolina","Marlboro County",2]
[null,null,null,null,null,null,null,null,null,null,null,null,null,"South Carolina","McCormick County",2]
[null,null,null,null,null,null,null,null,null,null,null,null,null,"South Carolina","Newberry County",2]
[null,null,null,null,null,null,null,null,null,null,null,null,null,"South Carolina","Oconee County",2]
[null,null,null,null,null,null,null,null,null,null,null,null,null,"South Carolina","Orangeburg County",2]
[null,null,null,null,null,null,null,null,null,null,null,null,null,"South Carolina","Pickens County",3]
[null,null,null,null,null,null,null,null,null,null,null,null,null,"South Carolina","Richland County",2]
[null,null,null,null,null,null,null,null,null,null,null,null,null,"South Carolina","Saluda County","Not Eligible for Credit"]
[null,null,null,null,null,null,null,null,null,null,null,null,null,"South Carolina","Spartanburg County",2]
[null,null,null,null,null,null,null,null,null,null,null,null,null,"South Carolina","Sumter County",2]
[null,null,null,null,null,null,null,null,null,null,null,null,null,"South Carolina","Union County",2]
[null,null,null,null,null,null,null,null,null,null,null,null,null,"South Carolina","Williamsburg County",2]
[null,null,null,null,null,null,null,null,null,null,null,null,null,"South Carolina","York County",2]
[null,null,null,null,null,null,null,null,null,null,null,null,null,"South Dakota","Aurora County",2]
[null,null,null,null,null,null,null,null,null,null,null,null,null,"South Dakota","Beadle County",2]
[null,null,null,null,null,null,null,null,null,null,null,null,null,"South Dakota","Bennett County",2]
[null,null,null,null,null,null,null,null,null,null,null,null,null,"South Dakota","Bon Homme County",2]
[null,null,null,null,null,null,null,null,null,null,null,null,null,"South Dakota","Brookings County",2]
[null,null,null,null,null,null,null,null,null,null,null,null,null,"South Dakota","Brown County",2]
[null,null,null,null,null,null,null,null,null,null,null,null,null,"South Dakota","Brule County",2]
[null,null,null,null,null,null,null,null,null,null,null,null,null,"South Dakota","Buffalo County",2]
[null,null,null,null,null,null,null,null,null,null,null,null,null,"South Dakota","Butte County",2]
[null,null,null,null,null,null,null,null,null,null,null,null,null,"South Dakota","Campbell County",2]
[null,null,null,null,null,null,null,null,null,null,null,null,null,"South Dakota","Charles Mix County",2]
[null,null,null,null,null,null,null,null,null,null,null,null,null,"South Dakota","Clark County",2]
[null,null,null,null,null,null,null,null,null,null,null,null,null,"South Dakota","Clay County",2]
[null,null,null,null,null,null,null,null,null,null,null,null,null,"South Dakota","Codington County",2]
[null,null,null,null,null,null,null,null,null,null,null,null,null,"South Dakota","Corson County",2]
[null,null,null,null,null,null,null,null,null,null,null,null,null,"South Dakota","Custer County",3]
[null,null,null,null,null,null,null,null,null,null,null,null,null,"South Dakota","Davison County",2]
[null,null,null,null,null,null,null,null,null,null,null,null,null,"South Dakota","Day County",2]
[null,null,null,null,null,null,null,null,null,null,null,null,null,"South Dakota","Deuel County",2]
[null,null,null,null,null,null,null,null,null,null,null,null,null,"South Dakota","Dewey County",2]
[null,null,null,null,null,null,null,null,null,null,null,null,null,"South Dakota","Douglas County",2]
[null,null,null,null,null,null,null,null,null,null,null,null,null,"South Dakota","Edmunds County",2]
[null,null,null,null,null,null,null,null,null,null,null,null,null,"South Dakota","Fall River County",2]
[null,null,null,null,null,null,null,null,null,null,null,null,null,"South Dakota","Faulk County",2]
[null,null,null,null,null,null,null,null,null,null,null,null,null,"South Dakota","Grant County",2]
[null,null,null,null,null,null,null,null,null,null,null,null,null,"South Dakota","Gregory County",2]
[null,null,null,null,null,null,null,null,null,null,null,null,null,"South Dakota","Haakon County",2]
[null,null,null,null,null,null,null,null,null,null,null,null,null,"South Dakota","Hamlin County",2]
[null,null,null,null,null,null,null,null,null,null,null,null,null,"South Dakota","Hand County",2]
[null,null,null,null,null,null,null,null,null,null,null,null,null,"South Dakota","Hanson County",2]
[null,null,null,null,null,null,null,null,null,null,null,null,null,"South Dakota","Harding County",3]
[null,null,null,null,null,null,null,null,null,null,null,null,null,"South Dakota","Hughes County",2]
[null,null,null,null,null,null,null,null,null,null,null,null,null,"South Dakota","Hutchinson County",2]
[null,null,null,null,null,null,null,null,null,null,null,null,null,"South Dakota","Hyde County",2]
[null,null,null,null,null,null,null,null,null,null,null,null,null,"South Dakota","Jackson County",2]
[null,null,null,null,null,null,null,null,null,null,null,null,null,"South Dakota","Jerauld County",2]
[null,null,null,null,null,null,null,null,null,null,null,null,null,"South Dakota","Jones County",2]
[null,null,null,null,null,null,null,null,null,null,null,null,null,"South Dakota","Kingsbury County",2]
[null,null,null,null,null,null,null,null,null,null,null,null,null,"South Dakota","Lake County",2]
[null,null,null,null,null,null,null,null,null,null,null,null,null,"South Dakota","Lawrence County",2]
[null,null,null,null,null,null,null,null,null,null,null,null,null,"South Dakota","Lincoln County",2]
[null,null,null,null,null,null,null,null,null,null,null,null,null,"South Dakota","Lyman County",2]
[null,null,null,null,null,null,null,null,null,null,null,null,null,"South Dakota","Marshall County",2]
[null,null,null,null,null,null,null,null,null,null,null,null,null,"South Dakota","McCook County",2]
[null,null,null,null,null,null,null,null,null,null,null,null,null,"South Dakota","McPherson County",2]
[null,null,null,null,null,null,null,null,null,null,null,null,null,"South Dakota","Meade County",2]
[null,null,null,null,null,null,null,null,null,null,null,null,null,"South Dakota","Mellette County",2]
[null,null,null,null,null,null,null,null,null,null,null,null,null,"South Dakota","Miner County",2]
[null,null,null,null,null,null,null,null,null,null,null,null,null,"South Dakota","Minnehaha County",2]
[null,null,null,null,null,null,null,null,null,null,null,null,null,"South Dakota","Moody County",2]
[null,null,null,null,null,null,null,null,null,null,null,null,null,"South Dakota","Oglala Lakota County",2]
[null,null,null,null,null,null,null,null,null,null,null,null,null,"South Dakota","Pennington County",2]
[null,null,null,null,null,null,null,null,null,null,null,null,null,"South Dakota","Perkins County",2]
[null,null,null,null,null,null,null,null,null,null,null,null,null,"South Dakota","Potter County",2]
[null,null,null,null,null,null,null,null,null,null,null,null,null,"South Dakota","Roberts County",2]
[null,null,null,null,null,null,null,null,null,null,null,null,null,"South Dakota","Sanborn County",2]
[null,null,null,null,null,null,null,null,null,null,null,null,null,"South Dakota","Spink County",2]
[null,null,null,null,null,null,null,null,null,null,null,null,null,"South Dakota","Stanley County",2]
[null,null,null,null,null,null,null,null,null,null,null,null,null,"South Dakota","Sully County",3]
[null,null,null,null,null,null,null,null,null,null,null,null,null,"South Dakota","Todd County",2]
[null,null,null,null,null,null,null,null,null,null,null,null,null,"South Dakota","Tripp County",2]
[null,null,null,null,null,null,null,null,null,null,null,null,null,"South Dakota","Turner County",2]
[null,null,null,null,null,null,null,null,null,null,null,null,null,"South Dakota","Union County",2]
[null,null,null,null,null,null,null,null,null,null,null,null,null,"South Dakota","Walworth County",2]
[null,null,null,null,null,null,null,null,null,null,null,null,null,"South Dakota","Yankton County",2]
[null,null,null,null,null,null,null,null,null,null,null,null,null,"South Dakota","Ziebach County",2]
[null,null,null,null,null,null,null,null,null,null,null,null,null,"Tennessee","Anderson County",2]
[null,null,null,null,null,null,null,null,null,null,null,null,null,"Tennessee","Bedford County","Not Eligible for Credit"]
[null,null,null,null,null,null,null,null,null,null,null,null,null,"Tennessee","Benton County","Not Eligible for Credit"]
[null,null,null,null,null,null,null,null,null,null,null,null,null,"Tennessee","Bledsoe County",2]
[null,null,null,null,null,null,null,null,null,null,null,null,null,"Tennessee","Blount County",2]
[null,null,null,null,null,null,null,null,null,null,null,null,null,"Tennessee","Bradley County",2]
[null,null,null,null,null,null,null,null,null,null,null,null,null,"Tennessee","Campbell County",2]
[null,null,null,null,null,null,null,null,null,null,null,null,null,"Tennessee","Cannon County","Not Eligible for Credit"]
[null,null,null,null,null,null,null,null,null,null,null,null,null,"Tennessee","Carroll County","Not Eligible for Credit"]
[null,null,null,null,null,null,null,null,null,null,null,null,null,"Tennessee","Carter County",3]
[null,null,null,null,null,null,null,null,null,null,null,null,null,"Tennessee","Cheatham County",2]
[null,null,null,null,null,null,null,null,null,null,null,null,null,"Tennessee","Chester County",2]
[null,null,null,null,null,null,null,null,null,null,null,null,null,"Tennessee","Claiborne County",2]
[null,null,null,null,null,null,null,null,null,null,null,null,null,"Tennessee","Clay County","Not Eligible for Credit"]
[null,null,null,null,null,null,null,null,null,null,null,null,null,"Tennessee","Cocke County",2]
[null,null,null,null,null,null,null,null,null,null,null,null,null,"Tennessee","Coffee County","Not Eligible for Credit"]
[null,null,null,null,null,null,null,null,null,null,null,null,null,"Tennessee","Crockett County","Not Eligible for Credit"]
[null,null,null,null,null,null,null,null,null,null,null,null,null,"Tennessee","Cumberland County",2]
[null,null,null,null,null,null,null,null,null,null,null,null,null,"Tennessee","Davidson County",2]
[null,null,null,null,null,null,null,null,null,null,null,null,null,"Tennessee","Decatur County","Not Eligible for Credit"]
[null,null,null,null,null,null,null,null,null,null,null,null,null,"Tennessee","DeKalb County","Not Eligible for Credit"]
[null,null,null,null,null,null,null,null,null,null,null,null,null,"Tennessee","Dickson County",2]
[null,null,null,null,null,null,null,null,null,null,null,null,null,"Tennessee","Dyer County","Not Eligible for Credit"]
[null,null,null,null,null,null,null,null,null,null,null,null,null,"Tennessee","Fayette County","Not Eligible for Credit"]
[null,null,null,null,null,null,null,null,null,null,null,null,null,"Tennessee","Fentress County",3]
[null,null,null,null,null,null,null,null,null,null,null,null,null,"Tennessee","Franklin County","Not Eligible for Credit"]
[null,null,null,null,null,null,null,null,null,null,null,null,null,"Tennessee","Gibson County","Not Eligible for Credit"]
[null,null,null,null,null,null,null,null,null,null,null,null,null,"Tennessee","Giles County","Not Eligible for Credit"]
[null,null,null,null,null,null,null,null,null,null,null,null,null,"Tennessee","Grainger County",2]
[null,null,null,null,null,null,null,null,null,null,null,null,null,"Tennessee","Greene County",2]
[null,null,null,null,null,null,null,null,null,null,null,null,null,"Tennessee","Grundy County",2]
[null,null,null,null,null,null,null,null,null,null,null,null,null,"Tennessee","Hamblen County",2]
[null,null,null,null,null,null,null,null,null,null,null,null,null,"Tennessee","Hamilton County",2]
[null,null,null,null,null,null,null,null,null,null,null,null,null,"Tennessee","Hancock County",2]
[null,null,null,null,null,null,null,null,null,null,null,null,null,"Tennessee","Hardeman County","Not Eligible for Credit"]
[null,null,null,null,null,null,null,null,null,null,null,null,null,"Tennessee","Hardin County","Not Eligible for Credit"]
[null,null,null,null,null,null,null,null,null,null,null,null,null,"Tennessee","Hawkins County",2]
[null,null,null,null,null,null,null,null,null,null,null,null,null,"Tennessee","Haywood County",2]
[null,null,null,null,null,null,null,null,null,null,null,null,null,"Tennessee","Henderson County","Not Eligible for Credit"]
[null,null,null,null,null,null,null,null,null,null,null,null,null,"Tennessee","Henry County","Not Eligible for Credit"]
[null,null,null,null,null,null,null,null,null,null,null,null,null,"Tennessee","Hickman County",2]
[null,null,null,null,null,null,null,null,null,null,null,null,null,"Tennessee","Houston County",2]
[null,null,null,null,null,null,null,null,null,null,null,null,null,"Tennessee","Humphreys County","Not Eligible for Credit"]
[null,null,null,null,null,null,null,null,null,null,null,null,null,"Tennessee","Jackson County",2]
[null,null,null,null,null,null,null,null,null,null,null,null,null,"Tennessee","Jefferson County",2]
[null,null,null,null,null,null,null,null,null,null,null,null,null,"Tennessee","Johnson County",2]
[null,null,null,null,null,null,null,null,null,null,null,null,null,"Tennessee","Knox County",2]
[null,null,null,null,null,null,null,null,null,null,null,null,null,"Tennessee","Lake County","Not Eligible for Credit"]
[null,null,null,null,null,null,null,null,null,null,null,null,null,"Tennessee","Lauderdale County",2]
[null,null,null,null,null,null,null,null,null,null,null,null,null,"Tennessee","Lawrence County","Not Eligible for Credit"]
[null,null,null,null,null,null,null,null,null,null,null,null,null,"Tennessee","Lewis County",2]
[null,null,null,null,null,null,null,null,null,null,null,null,null,"Tennessee","Lincoln County","Not Eligible for Credit"]
[null,null,null,null,null,null,null,null,null,null,null,null,null,"Tennessee","Loudon County",2]
[null,null,null,null,null,null,null,null,null,null,null,null,null,"Tennessee","Macon County",2]
[null,null,null,null,null,null,null,null,null,null,null,null,null,"Tennessee","Madison County","Not Eligible for Credit"]
[null,null,null,null,null,null,null,null,null,null,null,null,null,"Tennessee","Marion County","Not Eligible for Credit"]
[null,null,null,null,null,null,null,null,null,null,null,null,null,"Tennessee","Marshall County","Not Eligible for Credit"]
[null,null,null,null,null,null,null,null,null,null,null,null,null,"Tennessee","Maury County","Not Eligible for Credit"]
[null,null,null,null,null,null,null,null,null,null,null,null,null,"Tennessee","McMinn County","Not Eligible for Credit"]
[null,null,null,null,null,null,null,null,null,null,null,null,null,"Tennessee","McNairy County","Not Eligible for Credit"]
[null,null,null,null,null,null,null,null,null,null,null,null,null,"Tennessee","Meigs County","Not Eligible for Credit"]
[null,null,null,null,null,null,null,null,null,null,null,null,null,"Tennessee","Monroe County",2]
[null,null,null,null,null,null,null,null,null,null,null,null,null,"Tennessee","Montgomery County",2]
[null,null,null,null,null,null,null,null,null,null,null,null,null,"Tennessee","Moore County","Not Eligible for Credit"]
[null,null,null,null,null,null,null,null,null,null,null,null,null,"Tennessee","Morgan County",2]
[null,null,null,null,null,null,null,null,null,null,null,null,null,"Tennessee","Obion County","Not Eligible for Credit"]
[null,null,null,null,null,null,null,null,null,null,null,null,null,"Tennessee","Overton County",2]
[null,null,null,null,null,null,null,null,null,null,null,null,null,"Tennessee","Perry County","Not Eligible for Credit"]
[null,null,null,null,null,null,null,null,null,null,null,null,null,"Tennessee","Pickett County",2]
[null,null,null,null,null,null,null,null,null,null,null,null,null,"Tennessee","Polk County",2]
[null,null,null,null,null,null,null,null,null,null,null,null,null,"Tennessee","Putnam County","Not Eligible for Credit"]
[null,null,null,null,null,null,null,null,null,null,null,null,null,"Tennessee","Rhea County","Not Eligible for Credit"]
[null,null,null,null,null,null,null,null,null,null,null,null,null,"Tennessee","Roane County",2]
[null,null,null,null,null,null,null,null,null,null,null,null,null,"Tennessee","Robertson County","Not Eligible for Credit"]
[null,null,null,null,null,null,null,null,null,null,null,null,null,"Tennessee","Rutherford County","Not Eligible for Credit"]
[null,null,null,null,null,null,null,null,null,null,null,null,null,"Tennessee","Scott County",2]
[null,null,null,null,null,null,null,null,null,null,null,null,null,"Tennessee","Sequatchie County",2]
[null,null,null,null,null,null,null,null,null,null,null,null,null,"Tennessee","Sevier County",2]
[null,null,null,null,null,null,null,null,null,null,null,null,null,"Tennessee","Shelby County","Not Eligible for Credit"]
[null,null,null,null,null,null,null,null,null,null,null,null,null,"Tennessee","Smith County",2]
[null,null,null,null,null,null,null,null,null,null,null,null,null,"Tennessee","Stewart County","Not Eligible for Credit"]
[null,null,null,null,null,null,null,null,null,null,null,null,null,"Tennessee","Sullivan County",3]
[null,null,null,null,null,null,null,null,null,null,null,null,null,"Tennessee","Sumner County","Not Eligible for Credit"]
[null,null,null,null,null,null,null,null,null,null,null,null,null,"Tennessee","Tipton County","Not Eligible for Credit"]
[null,null,null,null,null,null,null,null,null,null,null,null,null,"Tennessee","Trousdale County","Not Eligible for Credit"]
[null,null,null,null,null,null,null,null,null,null,null,null,null,"Tennessee","Unicoi County",3]
[null,null,null,null,null,null,null,null,null,null,null,null,null,"Tennessee","Union County",2]
[null,null,null,null,null,null,null,null,null,null,null,null,null,"Tennessee","Van Buren County",2]
[null,null,null,null,null,null,null,null,null,null,null,null,null,"Tennessee","Warren County","Not Eligible for Credit"]
[null,null,null,null,null,null,null,null,null,null,null,null,null,"Tennessee","Washington County",3]
[null,null,null,null,null,null,null,null,null,null,null,null,null,"Tennessee","Wayne County","Not Eligible for Credit"]
[null,null,null,null,null,null,null,null,null,null,null,null,null,"Tennessee","Weakley County","Not Eligible for Credit"]
[null,null,null,null,null,null,null,null,null,null,null,null,null,"Tennessee","White County",2]
[null,null,null,null,null,null,null,null,null,null,null,null,null,"Tennessee","Williamson County","Not Eligible for Credit"]
[null,null,null,null,null,null,null,null,null,null,null,null,null,"Tennessee","Wilson County",2]
[null,null,null,null,null,null,null,null,null,null,null,null,null,"Texas","Anderson County",2]
[null,null,null,null,null,null,null,null,null,null,null,null,null,"Texas","Andrews County",3]
[null,null,null,null,null,null,null,null,null,null,null,null,null,"Texas","Angelina County",2]
[null,null,null,null,null,null,null,null,null,null,null,null,null,"Texas","Aransas County","Not Eligible for Credit"]
[null,null,null,null,null,null,null,null,null,null,null,null,null,"Texas","Archer County",2]
[null,null,null,null,null,null,null,null,null,null,null,null,null,"Texas","Armstrong County",3]
[null,null,null,null,null,null,null,null,null,null,null,null,null,"Texas","Atascosa County",2]
[null,null,null,null,null,null,null,null,null,null,null,null,null,"Texas","Austin County","Not Eligible for Credit"]
[null,null,null,null,null,null,null,null,null,null,null,null,null,"Texas","Bailey County",3]
[null,null,null,null,null,null,null,null,null,null,null,null,null,"Texas","Bandera County",2]
[null,null,null,null,null,null,null,null,null,null,null,null,null,"Texas","Bastrop County","Not Eligible for Credit"]
[null,null,null,null,null,null,null,null,null,null,null,null,null,"Texas","Baylor County",2]
[null,null,null,null,null,null,null,null,null,null,null,null,null,"Texas","Bee County",2]
[null,null,null,null,null,null,null,null,null,null,null,null,null,"Texas","Bell County","Not Eligible for Credit"]
[null,null,null,null,null,null,null,null,null,null,null,null,null,"Texas","Bexar County",2]
[null,null,null,null,null,null,null,null,null,null,null,null,null,"Texas","Blanco County",2]
[null,null,null,null,null,null,null,null,null,null,null,null,null,"Texas","Borden County",3]
[null,null,null,null,null,null,null,null,null,null,null,null,null,"Texas","Bosque County",2]
[null,null,null,null,null,null,null,null,null,null,null,null,null,"Texas","Bowie County","Not Eligible for Credit"]
[null,null,null,null,null,null,null,null,null,null,null,null,null,"Texas","Brazoria County","Not Eligible for Credit"]
[null,null,null,null,null,null,null,null,null,null,null,null,null,"Texas","Brazos County","Not Eligible for Credit"]
[null,null,null,null,null,null,null,null,null,null,null,null,null,"Texas","Brewster County",3]
[null,null,null,null,null,null,null,null,null,null,null,null,null,"Texas","Briscoe County",3]
[null,null,null,null,null,null,null,null,null,null,null,null,null,"Texas","Brooks County",3]
[null,null,null,null,null,null,null,null,null,null,null,null,null,"Texas","Brown County",2]
[null,null,null,null,null,null,null,null,null,null,null,null,null,"Texas","Burleson County","Not Eligible for Credit"]
[null,null,null,null,null,null,null,null,null,null,null,null,null,"Texas","Burnet County",2]
[null,null,null,null,null,null,null,null,null,null,null,null,null,"Texas","Caldwell County","Not Eligible for Credit"]
[null,null,null,null,null,null,null,null,null,null,null,null,null,"Texas","Calhoun County","Not Eligible for Credit"]
[null,null,null,null,null,null,null,null,null,null,null,null,null,"Texas","Callahan County",2]
[null,null,null,null,null,null,null,null,null,null,null,null,null,"Texas","Cameron County",2]
[null,null,null,null,null,null,null,null,null,null,null,null,null,"Texas","Camp County","Not Eligible for Credit"]
[null,null,null,null,null,null,null,null,null,null,null,null,null,"Texas","Carson County",3]
[null,null,null,null,null,null,null,null,null,null,null,null,null,"Texas","Cass County","Not Eligible for Credit"]
[null,null,null,null,null,null,null,null,null,null,null,null,null,"Texas","Castro County",3]
[null,null,null,null,null,null,null,null,null,null,null,null,null,"Texas","Chambers County","Not Eligible for Credit"]
[null,null,null,null,null,null,null,null,null,null,null,null,null,"Texas","Cherokee County",2]
[null,null,null,null,null,null,null,null,null,null,null,null,null,"Texas","Childress County",3]
[null,null,null,null,null,null,null,null,null,null,null,null,null,"Texas","Clay County",2]
[null,null,null,null,null,null,null,null,null,null,null,null,null,"Texas","Cochran County",3]
[null,null,null,null,null,null,null,null,null,null,null,null,null,"Texas","Coke County",3]
[null,null,null,null,null,null,null,null,null,null,null,null,null,"Texas","Coleman County",2]
[null,null,null,null,null,null,null,null,null,null,null,null,null,"Texas","Collin County","Not Eligible for Credit"]
[null,null,null,null,null,null,null,null,null,null,null,null,null,"Texas","Collingsworth County",3]
[null,null,null,null,null,null,null,null,null,null,null,null,null,"Texas","Colorado County","Not Eligible for Credit"]
[null,null,null,null,null,null,null,null,null,null,null,null,null,"Texas","Comal County",2]
[null,null,null,null,null,null,null,null,null,null,null,null,null,"Texas","Comanche County",2]
[null,null,null,null,null,null,null,null,null,null,null,null,null,"Texas","Concho County",2]
[null,null,null,null,null,null,null,null,null,null,null,null,null,"Texas","Cooke County","Not Eligible for Credit"]
[null,null,null,null,null,null,null,null,null,null,null,null,null,"Texas","Coryell County",2]
[null,null,null,null,null,null,null,null,null,null,null,null,null,"Texas","Cottle County",3]
[null,null,null,null,null,null,null,null,null,null,null,null,null,"Texas","Crane County",3]
[null,null,null,null,null,null,null,null,null,null,null,null,null,"Texas","Crockett County",3]
[null,null,null,null,null,null,null,null,null,null,null,null,null,"Texas","Crosby County",3]
[null,null,null,null,null,null,null,null,null,null,null,null,null,"Texas","Culberson County",3]
[null,null,null,null,null,null,null,null,null,null,null,null,null,"Texas","Dallam County",3]
[null,null,null,null,null,null,null,null,null,null,null,null,null,"Texas","Dallas County",2]
[null,null,null,null,null,null,null,null,null,null,null,null,null,"Texas","Dawson County",3]
[null,null,null,null,null,null,null,null,null,null,null,null,null,"Texas","Deaf Smith County",3]
[null,null,null,null,null,null,null,null,null,null,null,null,null,"Texas","Delta County","Not Eligible for Credit"]
[null,null,null,null,null,null,null,null,null,null,null,null,null,"Texas","Denton County","Not Eligible for Credit"]
[null,null,null,null,null,null,null,null,null,null,null,null,null,"Texas","DeWitt County",2]
[null,null,null,null,null,null,null,null,null,null,null,null,null,"Texas","Dickens County",3]
[null,null,null,null,null,null,null,null,null,null,null,null,null,"Texas","Dimmit County",3]
[null,null,null,null,null,null,null,null,null,null,null,null,null,"Texas","Donley County",3]
[null,null,null,null,null,null,null,null,null,null,null,null,null,"Texas","Duval County",3]
[null,null,null,null,null,null,null,null,null,null,null,null,null,"Texas","Eastland County",2]
[null,null,null,null,null,null,null,null,null,null,null,null,null,"Texas","Ector County",3]
[null,null,null,null,null,null,null,null,null,null,null,null,null,"Texas","Edwards County",3]
[null,null,null,null,null,null,null,null,null,null,null,null,null,"Texas","El Paso County",6]
[null,null,null,null,null,null,null,null,null,null,null,null,null,"Texas","Ellis County","Not Eligible for Credit"]
[null,null,null,null,null,null,null,null,null,null,null,null,null,"Texas","Erath County",2]
[null,null,null,null,null,null,null,null,null,null,null,null,null,"Texas","Falls County","Not Eligible for Credit"]
[null,null,null,null,null,null,null,null,null,null,null,null,null,"Texas","Fannin County","Not Eligible for Credit"]
[null,null,null,null,null,null,null,null,null,null,null,null,null,"Texas","Fayette County","Not Eligible for Credit"]
[null,null,null,null,null,null,null,null,null,null,null,null,null,"Texas","Fisher County",3]
[null,null,null,null,null,null,null,null,null,null,null,null,null,"Texas","Floyd County",3]
[null,null,null,null,null,null,null,null,null,null,null,null,null,"Texas","Foard County",2]
[null,null,null,null,null,null,null,null,null,null,null,null,null,"Texas","Fort Bend County","Not Eligible for Credit"]
[null,null,null,null,null,null,null,null,null,null,null,null,null,"Texas","Franklin County","Not Eligible for Credit"]
[null,null,null,null,null,null,null,null,null,null,null,null,null,"Texas","Freestone County","Not Eligible for Credit"]
[null,null,null,null,null,null,null,null,null,null,null,null,null,"Texas","Frio County",2]
[null,null,null,null,null,null,null,null,null,null,null,null,null,"Texas","Gaines County",3]
[null,null,null,null,null,null,null,null,null,null,null,null,null,"Texas","Galveston County","Not Eligible for Credit"]
[null,null,null,null,null,null,null,null,null,null,null,null,null,"Texas","Garza County",3]
[null,null,null,null,null,null,null,null,null,null,null,null,null,"Texas","Gillespie County",2]
[null,null,null,null,null,null,null,null,null,null,null,null,null,"Texas","Glasscock County",3]
[null,null,null,null,null,null,null,null,null,null,null,null,null,"Texas","Goliad County",2]
[null,null,null,null,null,null,null,null,null,null,null,null,null,"Texas","Gonzales County",2]
[null,null,null,null,null,null,null,null,null,null,null,null,null,"Texas","Gray County",3]
[null,null,null,null,null,null,null,null,null,null,null,null,null,"Texas","Grayson County","Not Eligible for Credit"]
[null,null,null,null,null,null,null,null,null,null,null,null,null,"Texas","Gregg County","Not Eligible for Credit"]
[null,null,null,null,null,null,null,null,null,null,null,null,null,"Texas","Grimes County","Not Eligible for Credit"]
[null,null,null,null,null,null,null,null,null,null,null,null,null,"Texas","Guadalupe County","Not Eligible for Credit"]
[null,null,null,null,null,null,null,null,null,null,null,null,null,"Texas","Hale County",3]
[null,null,null,null,null,null,null,null,null,null,null,null,null,"Texas","Hall County",3]
[null,null,null,null,null,null,null,null,null,null,null,null,null,"Texas","Hamilton County",2]
[null,null,null,null,null,null,null,null,null,null,null,null,null,"Texas","Hansford County",3]
[null,null,null,null,null,null,null,null,null,null,null,null,null,"Texas","Hardeman County",3]
[null,null,null,null,null,null,null,null,null,null,null,null,null,"Texas","Hardin County","Not Eligible for Credit"]
[null,null,null,null,null,null,null,null,null,null,null,null,null,"Texas","Harris County","Not Eligible for Credit"]
[null,null,null,null,null,null,null,null,null,null,null,null,null,"Texas","Harrison County","Not Eligible for Credit"]
[null,null,null,null,null,null,null,null,null,null,null,null,null,"Texas","Hartley County",3]
[null,null,null,null,null,null,null,null,null,null,null,null,null,"Texas","Haskell County",2]
[null,null,null,null,null,null,null,null,null,null,null,null,null,"Texas","Hays County",2]
[null,null,null,null,null,null,null,null,null,null,null,null,null,"Texas","Hemphill County",3]
[null,null,null,null,null,null,null,null,null,null,null,null,null,"Texas","Henderson County",2]
[null,null,null,null,null,null,null,null,null,null,null,null,null,"Texas","Hidalgo County",3]
[null,null,null,null,null,null,null,null,null,null,null,null,null,"Texas","Hill County","Not Eligible for Credit"]
[null,null,null,null,null,null,null,null,null,null,null,null,null,"Texas","Hockley County",3]
[null,null,null,null,null,null,null,null,null,null,null,null,null,"Texas","Hood County",2]
[null,null,null,null,null,null,null,null,null,null,null,null,null,"Texas","Hopkins County","Not Eligible for Credit"]
[null,null,null,null,null,null,null,null,null,null,null,null,null,"Texas","Houston County","Not Eligible for Credit"]
[null,null,null,null,null,null,null,null,null,null,null,null,null,"Texas","Howard County",3]
[null,null,null,null,null,null,null,null,null,null,null,null,null,"Texas","Hudspeth County",3]
[null,null,null,null,null,null,null,null,null,null,null,null,null,"Texas","Hunt County","Not Eligible for Credit"]
[null,null,null,null,null,null,null,null,null,null,null,null,null,"Texas","Hutchinson County",3]
[null,null,null,null,null,null,null,null,null,null,null,null,null,"Texas","Irion County",3]
[null,null,null,null,null,null,null,null,null,null,null,null,null,"Texas","Jack County",2]
[null,null,null,null,null,null,null,null,null,null,null,null,null,"Texas","Jackson County","Not Eligible for Credit"]
[null,null,null,null,null,null,null,null,null,null,null,null,null,"Texas","Jasper County","Not Eligible for Credit"]
[null,null,null,null,null,null,null,null,null,null,null,null,null,"Texas","Jeff Davis County",3]
[null,null,null,null,null,null,null,null,null,null,null,null,null,"Texas","Jefferson County","Not Eligible for Credit"]
[null,null,null,null,null,null,null,null,null,null,null,null,null,"Texas","Jim Hogg County",3]
[null,null,null,null,null,null,null,null,null,null,null,null,null,"Texas","Jim Wells County",2]
[null,null,null,null,null,null,null,null,null,null,null,null,null,"Texas","Johnson County","Not Eligible for Credit"]
[null,null,null,null,null,null,null,null,null,null,null,null,null,"Texas","Jones County",3]
[null,null,null,null,null,null,null,null,null,null,null,null,null,"Texas","Karnes County",2]
[null,null,null,null,null,null,null,null,null,null,null,null,null,"Texas","Kaufman County","Not Eligible for Credit"]
[null,null,null,null,null,null,null,null,null,null,null,null,null,"Texas","Kendall County",2]
[null,null,null,null,null,null,null,null,null,null,null,null,null,"Texas","Kenedy County",3]
[null,null,null,null,null,null,null,null,null,null,null,null,null,"Texas","Kent County",3]
[null,null,null,null,null,null,null,null,null,null,null,null,null,"Texas","Kerr County",2]
[null,null,null,null,null,null,null,null,null,null,null,null,null,"Texas","Kimble County",2]
[null,null,null,null,null,null,null,null,null,null,null,null,null,"Texas","King County",3]
[null,null,null,null,null,null,null,null,null,null,null,null,null,"Texas","Kinney County",2]
[null,null,null,null,null,null,null,null,null,null,null,null,null,"Texas","Kleberg County",2]
[null,null,null,null,null,null,null,null,null,null,null,null,null,"Texas","Knox County",3]
[null,null,null,null,null,null,null,null,null,null,null,null,null,"Texas","La Salle County",3]
[null,null,null,null,null,null,null,null,null,null,null,null,null,"Texas","Lamar County","Not Eligible for Credit"]
[null,null,null,null,null,null,null,null,null,null,null,null,null,"Texas","Lamb County",3]
[null,null,null,null,null,null,null,null,null,null,null,null,null,"Texas","Lampasas County",2]
[null,null,null,null,null,null,null,null,null,null,null,null,null,"Texas","Lavaca County","Not Eligible for Credit"]
[null,null,null,null,null,null,null,null,null,null,null,null,null,"Texas","Lee County","Not Eligible for Credit"]
[null,null,null,null,null,null,null,null,null,null,null,null,null,"Texas","Leon County","Not Eligible for Credit"]
[null,null,null,null,null,null,null,null,null,null,null,null,null,"Texas","Liberty County","Not Eligible for Credit"]
[null,null,null,null,null,null,null,null,null,null,null,null,null,"Texas","Limestone County","Not Eligible for Credit"]
[null,null,null,null,null,null,null,null,null,null,null,null,null,"Texas","Lipscomb County",3]
[null,null,null,null,null,null,null,null,null,null,null,null,null,"Texas","Live Oak County",2]
[null,null,null,null,null,null,null,null,null,null,null,null,null,"Texas","Llano County",2]
[null,null,null,null,null,null,null,null,null,null,null,null,null,"Texas","Loving County",6]
[null,null,null,null,null,null,null,null,null,null,null,null,null,"Texas","Lubbock County",3]
[null,null,null,null,null,null,null,null,null,null,null,null,null,"Texas","Lynn County",3]
[null,null,null,null,null,null,null,null,null,null,null,null,null,"Texas","Madison County","Not Eligible for Credit"]
[null,null,null,null,null,null,null,null,null,null,null,null,null,"Texas","Marion County","Not Eligible for Credit"]
[null,null,null,null,null,null,null,null,null,null,null,null,null,"Texas","Martin County",3]
[null,null,null,null,null,null,null,null,null,null,null,null,null,"Texas","Mason County",3]
[null,null,null,null,null,null,null,null,null,null,null,null,null,"Texas","Matagorda County","Not Eligible for Credit"]
[null,null,null,null,null,null,null,null,null,null,null,null,null,"Texas","Maverick County",3]
[null,null,null,null,null,null,null,null,null,null,null,null,null,"Texas","McCulloch County",2]
[null,null,null,null,null,null,null,null,null,null,null,null,null,"Texas","McLennan County","Not Eligible for Credit"]
[null,null,null,null,null,null,null,null,null,null,null,null,null,"Texas","McMullen County",2]
[null,null,null,null,null,null,null,null,null,null,null,null,null,"Texas","Medina County",2]
[null,null,null,null,null,null,null,null,null,null,null,null,null,"Texas","Menard County",3]
[null,null,null,null,null,null,null,null,null,null,null,null,null,"Texas","Midland County",3]
[null,null,null,null,null,null,null,null,null,null,null,null,null,"Texas","Milam County","Not Eligible for Credit"]
[null,null,null,null,null,null,null,null,null,null,null,null,null,"Texas","Mills County",2]
[null,null,null,null,null,null,null,null,null,null,null,null,null,"Texas","Mitchell County",3]
[null,null,null,null,null,null,null,null,null,null,null,null,null,"Texas","Montague County",2]
[null,null,null,null,null,null,null,null,null,null,null,null,null,"Texas","Montgomery County","Not Eligible for Credit"]
[null,null,null,null,null,null,null,null,null,null,null,null,null,"Texas","Moore County",3]
[null,null,null,null,null,null,null,null,null,null,null,null,null,"Texas","Morris County","Not Eligible for Credit"]
[null,null,null,null,null,null,null,null,null,null,null,null,null,"Texas","Motley County",3]
[null,null,null,null,null,null,null,null,null,null,null,null,null,"Texas","Nacogdoches County",2]
[null,null,null,null,null,null,null,null,null,null,null,null,null,"Texas","Navarro County","Not Eligible for Credit"]
[null,null,null,null,null,null,null,null,null,null,null,null,null,"Texas","Newton County","Not Eligible for Credit"]
[null,null,null,null,null,null,null,null,null,null,null,null,null,"Texas","Nolan County",2]
[null,null,null,null,null,null,null,null,null,null,null,null,null,"Texas","Nueces County",2]
[null,null,null,null,null,null,null,null,null,null,null,null,null,"Texas","Ochiltree County",3]
[null,null,null,null,null,null,null,null,null,null,null,null,null,"Texas","Oldham County",3]
[null,null,null,null,null,null,null,null,null,null,null,null,null,"Texas","Orange County","Not Eligible for Credit"]
[null,null,null,null,null,null,null,null,null,null,null,null,null,"Texas","Palo Pinto County",2]
[null,null,null,null,null,null,null,null,null,null,null,null,null,"Texas","Panola County","Not Eligible for Credit"]
[null,null,null,null,null,null,null,null,null,null,null,null,null,"Texas","Parker County",2]
[null,null,null,null,null,null,null,null,null,null,null,null,null,"Texas","Parmer County",3]
[null,null,null,null,null,null,null,null,null,null,null,null,null,"Texas","Pecos County",3]
[null,null,null,null,null,null,null,null,null,null,null,null,null,"Texas","Polk County","Not Eligible for Credit"]
[null,null,null,null,null,null,null,null,null,null,null,null,null,"Texas","Potter County",3]
[null,null,null,null,null,null,null,null,null,null,null,null,null,"Texas","Presidio County",3]
[null,null,null,null,null,null,null,null,null,null,null,null,null,"Texas","Rains County","Not Eligible for Credit"]
[null,null,null,null,null,null,null,null,null,null,null,null,null,"Texas","Randall County",3]
[null,null,null,null,null,null,null,null,null,null,null,null,null,"Texas","Reagan County",3]
[null,null,null,null,null,null,null,null,null,null,null,null,null,"Texas","Real County",2]
[null,null,null,null,null,null,null,null,null,null,null,null,null,"Texas","Red River County","Not Eligible for Credit"]
[null,null,null,null,null,null,null,null,null,null,null,null,null,"Texas","Reeves County",3]
[null,null,null,null,null,null,null,null,null,null,null,null,null,"Texas","Refugio County","Not Eligible for Credit"]
[null,null,null,null,null,null,null,null,null,null,null,null,null,"Texas","Roberts County",3]
[null,null,null,null,null,null,null,null,null,null,null,null,null,"Texas","Robertson County","Not Eligible for Credit"]
[null,null,null,null,null,null,null,null,null,null,null,null,null,"Texas","Rockwall County","Not Eligible for Credit"]
[null,null,null,null,null,null,null,null,null,null,null,null,null,"Texas","Runnels County",2]
[null,null,null,null,null,null,null,null,null,null,null,null,null,"Texas","Rusk County","Not Eligible for Credit"]
[null,null,null,null,null,null,null,null,null,null,null,null,null,"Texas","Sabine County","Not Eligible for Credit"]
[null,null,null,null,null,null,null,null,null,null,null,null,null,"Texas","San Augustine County","Not Eligible for Credit"]
[null,null,null,null,null,null,null,null,null,null,null,null,null,"Texas","San Jacinto County","Not Eligible for Credit"]
[null,null,null,null,null,null,null,null,null,null,null,null,null,"Texas","San Patricio County",2]
[null,null,null,null,null,null,null,null,null,null,null,null,null,"Texas","San Saba County",2]
[null,null,null,null,null,null,null,null,null,null,null,null,null,"Texas","Schleicher County",3]
[null,null,null,null,null,null,null,null,null,null,null,null,null,"Texas","Scurry County",3]
[null,null,null,null,null,null,null,null,null,null,null,null,null,"Texas","Shackelford County",2]
[null,null,null,null,null,null,null,null,null,null,null,null,null,"Texas","Shelby County","Not Eligible for Credit"]
[null,null,null,null,null,null,null,null,null,null,null,null,null,"Texas","Sherman County",3]
[null,null,null,null,null,null,null,null,null,null,null,null,null,"Texas","Smith County",2]
[null,null,null,null,null,null,null,null,null,null,null,null,null,"Texas","Somervell County",2]
[null,null,null,null,null,null,null,null,null,null,null,null,null,"Texas","Starr County",2]
[null,null,null,null,null,null,null,null,null,null,null,null,null,"Texas","Stephens County",2]
[null,null,null,null,null,null,null,null,null,null,null,null,null,"Texas","Sterling County",3]
[null,null,null,null,null,null,null,null,null,null,null,null,null,"Texas","Stonewall County",3]
[null,null,null,null,null,null,null,null,null,null,null,null,null,"Texas","Sutton County",3]
[null,null,null,null,null,null,null,null,null,null,null,null,null,"Texas","Swisher County",3]
[null,null,null,null,null,null,null,null,null,null,null,null,null,"Texas","Tarrant County","Not Eligible for Credit"]
[null,null,null,null,null,null,null,null,null,null,null,null,null,"Texas","Taylor County",3]
[null,null,null,null,null,null,null,null,null,null,null,null,null,"Texas","Terrell County",3]
[null,null,null,null,null,null,null,null,null,null,null,null,null,"Texas","Terry County",3]
[null,null,null,null,null,null,null,null,null,null,null,null,null,"Texas","Throckmorton County",2]
[null,null,null,null,null,null,null,null,null,null,null,null,null,"Texas","Titus County","Not Eligible for Credit"]
[null,null,null,null,null,null,null,null,null,null,null,null,null,"Texas","Tom Green County",3]
[null,null,null,null,null,null,null,null,null,null,null,null,null,"Texas","Travis County",2]
[null,null,null,null,null,null,null,null,null,null,null,null,null,"Texas","Trinity County","Not Eligible for Credit"]
[null,null,null,null,null,null,null,null,null,null,null,null,null,"Texas","Tyler County","Not Eligible for Credit"]
[null,null,null,null,null,null,null,null,null,null,null,null,null,"Texas","Upshur County",2]
[null,null,null,null,null,null,null,null,null,null,null,null,null,"Texas","Upton County",3]
[null,null,null,null,null,null,null,null,null,null,null,null,null,"Texas","Uvalde County",2]
[null,null,null,null,null,null,null,null,null,null,null,null,null,"Texas","Val Verde County",3]
[null,null,null,null,null,null,null,null,null,null,null,null,null,"Texas","Van Zandt County","Not Eligible for Credit"]
[null,null,null,null,null,null,null,null,null,null,null,null,null,"Texas","Victoria County","Not Eligible for Credit"]
[null,null,null,null,null,null,null,null,null,null,null,null,null,"Texas","Walker County","Not Eligible for Credit"]
[null,null,null,null,null,null,null,null,null,null,null,null,null,"Texas","Waller County","Not Eligible for Credit"]
[null,null,null,null,null,null,null,null,null,null,null,null,null,"Texas","Ward County",3]
[null,null,null,null,null,null,null,null,null,null,null,null,null,"Texas","Washington County","Not Eligible for Credit"]
[null,null,null,null,null,null,null,null,null,null,null,null,null,"Texas","Webb County",3]
[null,null,null,null,null,null,null,null,null,null,null,null,null,"Texas","Wharton County","Not Eligible for Credit"]
[null,null,null,null,null,null,null,null,null,null,null,null,null,"Texas","Wheeler County",3]
[null,null,null,null,null,null,null,null,null,null,null,null,null,"Texas","Wichita County",2]
[null,null,null,null,null,null,null,null,null,null,null,null,null,"Texas","Wilbarger County",2]
[null,null,null,null,null,null,null,null,null,null,null,null,null,"Texas","Willacy County",2]
[null,null,null,null,null,null,null,null,null,null,null,null,null,"Texas","Williamson County","Not Eligible for Credit"]
[null,null,null,null,null,null,null,null,null,null,null,null,null,"Texas","Wilson County",2]
[null,null,null,null,null,null,null,null,null,null,null,null,null,"Texas","Winkler County",6]
[null,null,null,null,null,null,null,null,null,null,null,null,null,"Texas","Wise County",2]
[null,null,null,null,null,null,null,null,null,null,null,null,null,"Texas","Wood County","Not Eligible for Credit"]
[null,null,null,null,null,null,null,null,null,null,null,null,null,"Texas","Yoakum County",3]
[null,null,null,null,null,null,null,null,null,null,null,null,null,"Texas","Young County",2]
[null,null,null,null,null,null,null,null,null,null,null,null,null,"Texas","Zapata County",2]
[null,null,null,null,null,null,null,null,null,null,null,null,null,"Texas","Zavala County",2]
[null,null,null,null,null,null,null,null,null,null,null,null,null,"Utah","Beaver County",6]
[null,null,null,null,null,null,null,null,null,null,null,null,null,"Utah","Box Elder County",3]
[null,null,null,null,null,null,null,null,null,null,null,null,null,"Utah","Cache County",3]
[null,null,null,null,null,null,null,null,null,null,null,null,null,"Utah","Carbon County",3]
[null,null,null,null,null,null,null,null,null,null,null,null,null,"Utah","Daggett County",3]
[null,null,null,null,null,null,null,null,null,null,null,null,null,"Utah","Davis County",2]
[null,null,null,null,null,null,null,null,null,null,null,null,null,"Utah","Duchesne County",3]
[null,null,null,null,null,null,null,null,null,null,null,null,null,"Utah","Emery County",6]
[null,null,null,null,null,null,null,null,null,null,null,null,null,"Utah","Garfield County",6]
[null,null,null,null,null,null,null,null,null,null,null,null,null,"Utah","Grand County",3]
[null,null,null,null,null,null,null,null,null,null,null,null,null,"Utah","Iron County",6]
[null,null,null,null,null,null,null,null,null,null,null,null,null,"Utah","Juab County",3]
[null,null,null,null,null,null,null,null,null,null,null,null,null,"Utah","Kane County",6]
[null,null,null,null,null,null,null,null,null,null,null,null,null,"Utah","Millard County",3]
[null,null,null,null,null,null,null,null,null,null,null,null,null,"Utah","Morgan County",3]
[null,null,null,null,null,null,null,null,null,null,null,null,null,"Utah","Piute County",6]
[null,null,null,null,null,null,null,null,null,null,null,null,null,"Utah","Rich County",3]
[null,null,null,null,null,null,null,null,null,null,null,null,null,"Utah","Salt Lake County",3]
[null,null,null,null,null,null,null,null,null,null,null,null,null,"Utah","San Juan County",6]
[null,null,null,null,null,null,null,null,null,null,null,null,null,"Utah","Sanpete County",3]
[null,null,null,null,null,null,null,null,null,null,null,null,null,"Utah","Sevier County",3]
[null,null,null,null,null,null,null,null,null,null,null,null,null,"Utah","Summit County",3]
[null,null,null,null,null,null,null,null,null,null,null,null,null,"Utah","Tooele County",3]
[null,null,null,null,null,null,null,null,null,null,null,null,null,"Utah","Uintah County",3]
[null,null,null,null,null,null,null,null,null,null,null,null,null,"Utah","Utah County",3]
[null,null,null,null,null,null,null,null,null,null,null,null,null,"Utah","Wasatch County",3]
[null,null,null,null,null,null,null,null,null,null,null,null,null,"Utah","Washington County",6]
[null,null,null,null,null,null,null,null,null,null,null,null,null,"Utah","Wayne County",6]
[null,null,null,null,null,null,null,null,null,null,null,null,null,"Utah","Weber County",2]
[null,null,null,null,null,null,null,null,null,null,null,null,null,"Vermont","Addison County",2]
[null,null,null,null,null,null,null,null,null,null,null,null,null,"Vermont","Bennington County","Not Eligible for Credit"]
[null,null,null,null,null,null,null,null,null,null,null,null,null,"Vermont","Caledonia County","Not Eligible for Credit"]
[null,null,null,null,null,null,null,null,null,null,null,null,null,"Vermont","Chittenden County",2]
[null,null,null,null,null,null,null,null,null,null,null,null,null,"Vermont","Essex County","Not Eligible for Credit"]
[null,null,null,null,null,null,null,null,null,null,null,null,null,"Vermont","Franklin County",2]
[null,null,null,null,null,null,null,null,null,null,null,null,null,"Vermont","Grand Isle County",2]
[null,null,null,null,null,null,null,null,null,null,null,null,null,"Vermont","Lamoille County","Not Eligible for Credit"]
[null,null,null,null,null,null,null,null,null,null,null,null,null,"Vermont","Orange County",3]
[null,null,null,null,null,null,null,null,null,null,null,null,null,"Vermont","Orleans County","Not Eligible for Credit"]
[null,null,null,null,null,null,null,null,null,null,null,null,null,"Vermont","Rutland County",2]
[null,null,null,null,null,null,null,null,null,null,null,null,null,"Vermont","Washington County","Not Eligible for Credit"]
[null,null,null,null,null,null,null,null,null,null,null,null,null,"Vermont","Windham County",2]
[null,null,null,null,null,null,null,null,null,null,null,null,null,"Vermont","Windsor County","Not Eligible for Credit"]
[null,null,null,null,null,null,null,null,null,null,null,null,null,"Virginia","Accomack County",3]
[null,null,null,null,null,null,null,null,null,null,null,null,null,"Virginia","Albemarle County",2]
[null,null,null,null,null,null,null,null,null,null,null,null,null,"Virginia","Alexandria City",2]
[null,null,null,null,null,null,null,null,null,null,null,null,null,"Virginia","Alleghany County",3]
[null,null,null,null,null,null,null,null,null,null,null,null,null,"Virginia","Amelia County",2]
[null,null,null,null,null,null,null,null,null,null,null,null,null,"Virginia","Amherst County",2]
[null,null,null,null,null,null,null,null,null,null,null,null,null,"Virginia","Appomattox County",2]
[null,null,null,null,null,null,null,null,null,null,null,null,null,"Virginia","Arlington County",2]
[null,null,null,null,null,null,null,null,null,null,null,null,null,"Virginia","Augusta County",2]
[null,null,null,null,null,null,null,null,null,null,null,null,null,"Virginia","Bath County",3]
[null,null,null,null,null,null,null,null,null,null,null,null,null,"Virginia","Bedford County",3]
[null,null,null,null,null,null,null,null,null,null,null,null,null,"Virginia","Bland County",3]
[null,null,null,null,null,null,null,null,null,null,null,null,null,"Virginia","Botetourt County",2]
[null,null,null,null,null,null,null,null,null,null,null,null,null,"Virginia","Bristol City",3]
[null,null,null,null,null,null,null,null,null,null,null,null,null,"Virginia","Brunswick County",2]
[null,null,null,null,null,null,null,null,null,null,null,null,null,"Virginia","Buchanan County",3]
[null,null,null,null,null,null,null,null,null,null,null,null,null,"Virginia","Buckingham County",2]
[null,null,null,null,null,null,null,null,null,null,null,null,null,"Virginia","Buena Vista City",2]
[null,null,null,null,null,null,null,null,null,null,null,null,null,"Virginia","Campbell County",2]
[null,null,null,null,null,null,null,null,null,null,null,null,null,"Virginia","Caroline County",2]
[null,null,null,null,null,null,null,null,null,null,null,null,null,"Virginia","Carroll County",2]
[null,null,null,null,null,null,null,null,null,null,null,null,null,"Virginia","Charles City County","Not Eligible for Credit"]
[null,null,null,null,null,null,null,null,null,null,null,null,null,"Virginia","Charlotte County",2]
[null,null,null,null,null,null,null,null,null,null,null,null,null,"Virginia","Charlottesville City",2]
[null,null,null,null,null,null,null,null,null,null,null,null,null,"Virginia","Chesapeake City",2]
[null,null,null,null,null,null,null,null,null,null,null,null,null,"Virginia","Chesterfield County",2]
[null,null,null,null,null,null,null,null,null,null,null,null,null,"Virginia","Clarke County",2]
[null,null,null,null,null,null,null,null,null,null,null,null,null,"Virginia","Colonial Heights City",2]
[null,null,null,null,null,null,null,null,null,null,null,null,null,"Virginia","Covington City",3]
[null,null,null,null,null,null,null,null,null,null,null,null,null,"Virginia","Craig County",2]
[null,null,null,null,null,null,null,null,null,null,null,null,null,"Virginia","Culpeper County","Not Eligible for Credit"]
[null,null,null,null,null,null,null,null,null,null,null,null,null,"Virginia","Cumberland County",2]
[null,null,null,null,null,null,null,null,null,null,null,null,null,"Virginia","Danville City",2]
[null,null,null,null,null,null,null,null,null,null,null,null,null,"Virginia","Dickenson County",3]
[null,null,null,null,null,null,null,null,null,null,null,null,null,"Virginia","Dinwiddie County",2]
[null,null,null,null,null,null,null,null,null,null,null,null,null,"Virginia","Emporia City","Not Eligible for Credit"]
[null,null,null,null,null,null,null,null,null,null,null,null,null,"Virginia","Essex County","Not Eligible for Credit"]
[null,null,null,null,null,null,null,null,null,null,null,null,null,"Virginia","Fairfax City",2]
[null,null,null,null,null,null,null,null,null,null,null,null,null,"Virginia","Fairfax County",2]
[null,null,null,null,null,null,null,null,null,null,null,null,null,"Virginia","Falls Church City",2]
[null,null,null,null,null,null,null,null,null,null,null,null,null,"Virginia","Fauquier County",2]
[null,null,null,null,null,null,null,null,null,null,null,null,null,"Virginia","Floyd County",3]
[null,null,null,null,null,null,null,null,null,null,null,null,null,"Virginia","Fluvanna County",2]
[null,null,null,null,null,null,null,null,null,null,null,null,null,"Virginia","Franklin City","Not Eligible for Credit"]
[null,null,null,null,null,null,null,null,null,null,null,null,null,"Virginia","Franklin County",3]
[null,null,null,null,null,null,null,null,null,null,null,null,null,"Virginia","Frederick County",2]
[null,null,null,null,null,null,null,null,null,null,null,null,null,"Virginia","Fredericksburg City",2]
[null,null,null,null,null,null,null,null,null,null,null,null,null,"Virginia","Galax City",3]
[null,null,null,null,null,null,null,null,null,null,null,null,null,"Virginia","Giles County",3]
[null,null,null,null,null,null,null,null,null,null,null,null,null,"Virginia","Gloucester County",2]
[null,null,null,null,null,null,null,null,null,null,null,null,null,"Virginia","Goochland County",2]
[null,null,null,null,null,null,null,null,null,null,null,null,null,"Virginia","Grayson County",3]
[null,null,null,null,null,null,null,null,null,null,null,null,null,"Virginia","Greene County",2]
[null,null,null,null,null,null,null,null,null,null,null,null,null,"Virginia","Greensville County",2]
[null,null,null,null,null,null,null,null,null,null,null,null,null,"Virginia","Halifax County",2]
[null,null,null,null,null,null,null,null,null,null,null,null,null,"Virginia","Hampton City",2]
[null,null,null,null,null,null,null,null,null,null,null,null,null,"Virginia","Hanover County",2]
[null,null,null,null,null,null,null,null,null,null,null,null,null,"Virginia","Harrisonburg City",2]
[null,null,null,null,null,null,null,null,null,null,null,null,null,"Virginia","Henrico County","Not Eligible for Credit"]
[null,null,null,null,null,null,null,null,null,null,null,null,null,"Virginia","Henry County",3]
[null,null,null,null,null,null,null,null,null,null,null,null,null,"Virginia","Highland County",3]
[null,null,null,null,null,null,null,null,null,null,null,null,null,"Virginia","Hopewell City","Not Eligible for Credit"]
[null,null,null,null,null,null,null,null,null,null,null,null,null,"Virginia","Isle of Wight County","Not Eligible for Credit"]
[null,null,null,null,null,null,null,null,null,null,null,null,null,"Virginia","James City County","Not Eligible for Credit"]
[null,null,null,null,null,null,null,null,null,null,null,null,null,"Virginia","King and Queen County",2]
[null,null,null,null,null,null,null,null,null,null,null,null,null,"Virginia","King George County",2]
[null,null,null,null,null,null,null,null,null,null,null,null,null,"Virginia","King William County",2]
[null,null,null,null,null,null,null,null,null,null,null,null,null,"Virginia","Lancaster County","Not Eligible for Credit"]
[null,null,null,null,null,null,null,null,null,null,null,null,null,"Virginia","Lee County",3]
[null,null,null,null,null,null,null,null,null,null,null,null,null,"Virginia","Lexington City",3]
[null,null,null,null,null,null,null,null,null,null,null,null,null,"Virginia","Loudoun County",2]
[null,null,null,null,null,null,null,null,null,null,null,null,null,"Virginia","Louisa County",2]
[null,null,null,null,null,null,null,null,null,null,null,null,null,"Virginia","Lunenburg County",2]
[null,null,null,null,null,null,null,null,null,null,null,null,null,"Virginia","Lynchburg City",2]
[null,null,null,null,null,null,null,null,null,null,null,null,null,"Virginia","Madison County",2]
[null,null,null,null,null,null,null,null,null,null,null,null,null,"Virginia","Manassas City",2]
[null,null,null,null,null,null,null,null,null,null,null,null,null,"Virginia","Manassas Park City",2]
[null,null,null,null,null,null,null,null,null,null,null,null,null,"Virginia","Martinsville City",3]
[null,null,null,null,null,null,null,null,null,null,null,null,null,"Virginia","Mathews County",2]
[null,null,null,null,null,null,null,null,null,null,null,null,null,"Virginia","Mecklenburg County",2]
[null,null,null,null,null,null,null,null,null,null,null,null,null,"Virginia","Middlesex County",2]
[null,null,null,null,null,null,null,null,null,null,null,null,null,"Virginia","Montgomery County",3]
[null,null,null,null,null,null,null,null,null,null,null,null,null,"Virginia","Nelson County",2]
[null,null,null,null,null,null,null,null,null,null,null,null,null,"Virginia","New Kent County","Not Eligible for Credit"]
[null,null,null,null,null,null,null,null,null,null,null,null,null,"Virginia","Newport News City","Not Eligible for Credit"]
[null,null,null,null,null,null,null,null,null,null,null,null,null,"Virginia","Norfolk City",2]
[null,null,null,null,null,null,null,null,null,null,null,null,null,"Virginia","Northampton County",3]
[null,null,null,null,null,null,null,null,null,null,null,null,null,"Virginia","Northumberland County","Not Eligible for Credit"]
[null,null,null,null,null,null,null,null,null,null,null,null,null,"Virginia","Norton City",3]
[null,null,null,null,null,null,null,null,null,null,null,null,null,"Virginia","Nottoway County",2]
[null,null,null,null,null,null,null,null,null,null,null,null,null,"Virginia","Orange County","Not Eligible for Credit"]
[null,null,null,null,null,null,null,null,null,null,null,null,null,"Virginia","Page County",2]
[null,null,null,null,null,null,null,null,null,null,null,null,null,"Virginia","Patrick County",2]
[null,null,null,null,null,null,null,null,null,null,null,null,null,"Virginia","Petersburg City",2]
[null,null,null,null,null,null,null,null,null,null,null,null,null,"Virginia","Pittsylvania County",2]
[null,null,null,null,null,null,null,null,null,null,null,null,null,"Virginia","Poquoson City",2]
[null,null,null,null,null,null,null,null,null,null,null,null,null,"Virginia","Portsmouth City",2]
[null,null,null,null,null,null,null,null,null,null,null,null,null,"Virginia","Powhatan County","Not Eligible for Credit"]
[null,null,null,null,null,null,null,null,null,null,null,null,null,"Virginia","Prince Edward County",2]
[null,null,null,null,null,null,null,null,null,null,null,null,null,"Virginia","Prince George County",2]
[null,null,null,null,null,null,null,null,null,null,null,null,null,"Virginia","Prince William County",2]
[null,null,null,null,null,null,null,null,null,null,null,null,null,"Virginia","Pulaski County",3]
[null,null,null,null,null,null,null,null,null,null,null,null,null,"Virginia","Radford City",3]
[null,null,null,null,null,null,null,null,null,null,null,null,null,"Virginia","Rappahannock County",2]
[null,null,null,null,null,null,null,null,null,null,null,null,null,"Virginia","Richmond City",2]
[null,null,null,null,null,null,null,null,null,null,null,null,null,"Virginia","Richmond County","Not Eligible for Credit"]
[null,null,null,null,null,null,null,null,null,null,null,null,null,"Virginia","Roanoke City",3]
[null,null,null,null,null,null,null,null,null,null,null,null,null,"Virginia","Roanoke County",3]
[null,null,null,null,null,null,null,null,null,null,null,null,null,"Virginia","Rockbridge County",3]
[null,null,null,null,null,null,null,null,null,null,null,null,null,"Virginia","Rockingham County",2]
[null,null,null,null,null,null,null,null,null,null,null,null,null,"Virginia","Russell County",3]
[null,null,null,null,null,null,null,null,null,null,null,null,null,"Virginia","Salem City",3]
[null,null,null,null,null,null,null,null,null,null,null,null,null,"Virginia","Scott County",3]
[null,null,null,null,null,null,null,null,null,null,null,null,null,"Virginia","Shenandoah County",2]
[null,null,null,null,null,null,null,null,null,null,null,null,null,"Virginia","Smyth County",3]
[null,null,null,null,null,null,null,null,null,null,null,null,null,"Virginia","Southampton County","Not Eligible for Credit"]
[null,null,null,null,null,null,null,null,null,null,null,null,null,"Virginia","Spotsylvania County",2]
[null,null,null,null,null,null,null,null,null,null,null,null,null,"Virginia","Stafford County",2]
[null,null,null,null,null,null,null,null,null,null,null,null,null,"Virginia","Staunton City",2]
[null,null,null,null,null,null,null,null,null,null,null,null,null,"Virginia","Suffolk City",2]
[null,null,null,null,null,null,null,null,null,null,null,null,null,"Virginia","Surry County","Not Eligible for Credit"]
[null,null,null,null,null,null,null,null,null,null,null,null,null,"Virginia","Sussex County","Not Eligible for Credit"]
[null,null,null,null,null,null,null,null,null,null,null,null,null,"Virginia","Tazewell County",2]
[null,null,null,null,null,null,null,null,null,null,null,null,null,"Virginia","Virginia Beach City",2]
[null,null,null,null,null,null,null,null,null,null,null,null,null,"Virginia","Warren County",2]
[null,null,null,null,null,null,null,null,null,null,null,null,null,"Virginia","Washington County",3]
[null,null,null,null,null,null,null,null,null,null,null,null,null,"Virginia","Waynesboro City",2]
[null,null,null,null,null,null,null,null,null,null,null,null,null,"Virginia","Westmoreland County","Not Eligible for Credit"]
[null,null,null,null,null,null,null,null,null,null,null,null,null,"Virginia","Williamsburg City","Not Eligible for Credit"]
[null,null,null,null,null,null,null,null,null,null,null,null,null,"Virginia","Winchester City",2]
[null,null,null,null,null,null,null,null,null,null,null,null,null,"Virginia","Wise County",3]
[null,null,null,null,null,null,null,null,null,null,null,null,null,"Virginia","Wythe County",3]
[null,null,null,null,null,null,null,null,null,null,null,null,null,"Virginia","York County","Not Eligible for Credit"]
[null,null,null,null,null,null,null,null,null,null,null,null,null,"Washington","Adams County",6]
[null,null,null,null,null,null,null,null,null,null,null,null,null,"Washington","Asotin County",3]
[null,null,null,null,null,null,null,null,null,null,null,null,null,"Washington","Benton County",6]
[null,null,null,null,null,null,null,null,null,null,null,null,null,"Washington","Chelan County",6]
[null,null,null,null,null,null,null,null,null,null,null,null,null,"Washington","Clallam County",3]
[null,null,null,null,null,null,null,null,null,null,null,null,null,"Washington","Clark County",3]
[null,null,null,null,null,null,null,null,null,null,null,null,null,"Washington","Columbia County",3]
[null,null,null,null,null,null,null,null,null,null,null,null,null,"Washington","Cowlitz County",3]
[null,null,null,null,null,null,null,null,null,null,null,null,null,"Washington","Douglas County",6]
[null,null,null,null,null,null,null,null,null,null,null,null,null,"Washington","Ferry County",6]
[null,null,null,null,null,null,null,null,null,null,null,null,null,"Washington","Franklin County",3]
[null,null,null,null,null,null,null,null,null,null,null,null,null,"Washington","Garfield County",3]
[null,null,null,null,null,null,null,null,null,null,null,null,null,"Washington","Grant County",6]
[null,null,null,null,null,null,null,null,null,null,null,null,null,"Washington","Grays Harbor County",3]
[null,null,null,null,null,null,null,null,null,null,null,null,null,"Washington","Island County",3]
[null,null,null,null,null,null,null,null,null,null,null,null,null,"Washington","Jefferson County",3]
[null,null,null,null,null,null,null,null,null,null,null,null,null,"Washington","King County",3]
[null,null,null,null,null,null,null,null,null,null,null,null,null,"Washington","Kitsap County",3]
[null,null,null,null,null,null,null,null,null,null,null,null,null,"Washington","Kittitas County",6]
[null,null,null,null,null,null,null,null,null,null,null,null,null,"Washington","Klickitat County",6]
[null,null,null,null,null,null,null,null,null,null,null,null,null,"Washington","Lewis County",3]
[null,null,null,null,null,null,null,null,null,null,null,null,null,"Washington","Lincoln County",6]
[null,null,null,null,null,null,null,null,null,null,null,null,null,"Washington","Mason County",2]
[null,null,null,null,null,null,null,null,null,null,null,null,null,"Washington","Okanogan County",6]
[null,null,null,null,null,null,null,null,null,null,null,null,null,"Washington","Pacific County",2]
[null,null,null,null,null,null,null,null,null,null,null,null,null,"Washington","Pend Oreille County",3]
[null,null,null,null,null,null,null,null,null,null,null,null,null,"Washington","Pierce County",3]
[null,null,null,null,null,null,null,null,null,null,null,null,null,"Washington","San Juan County",3]
[null,null,null,null,null,null,null,null,null,null,null,null,null,"Washington","Skagit County",3]
[null,null,null,null,null,null,null,null,null,null,null,null,null,"Washington","Skamania County",3]
[null,null,null,null,null,null,null,null,null,null,null,null,null,"Washington","Snohomish County",3]
[null,null,null,null,null,null,null,null,null,null,null,null,null,"Washington","Spokane County",3]
[null,null,null,null,null,null,null,null,null,null,null,null,null,"Washington","Stevens County",3]
[null,null,null,null,null,null,null,null,null,null,null,null,null,"Washington","Thurston County",3]
[null,null,null,null,null,null,null,null,null,null,null,null,null,"Washington","Wahkiakum County",2]
[null,null,null,null,null,null,null,null,null,null,null,null,null,"Washington","Walla Walla County",6]
[null,null,null,null,null,null,null,null,null,null,null,null,null,"Washington","Whatcom County",3]
[null,null,null,null,null,null,null,null,null,null,null,null,null,"Washington","Whitman County",3]
[null,null,null,null,null,null,null,null,null,null,null,null,null,"Washington","Yakima County",3]
[null,null,null,null,null,null,null,null,null,null,null,null,null,"West Virginia","Barbour County",2]
[null,null,null,null,null,null,null,null,null,null,null,null,null,"West Virginia","Berkeley County",2]
[null,null,null,null,null,null,null,null,null,null,null,null,null,"West Virginia","Boone County",3]
[null,null,null,null,null,null,null,null,null,null,null,null,null,"West Virginia","Braxton County",2]
[null,null,null,null,null,null,null,null,null,null,null,null,null,"West Virginia","Brooke County",2]
[null,null,null,null,null,null,null,null,null,null,null,null,null,"West Virginia","Cabell County",3]
[null,null,null,null,null,null,null,null,null,null,null,null,null,"West Virginia","Calhoun County",3]
[null,null,null,null,null,null,null,null,null,null,null,null,null,"West Virginia","Clay County",3]
[null,null,null,null,null,null,null,null,null,null,null,null,null,"West Virginia","Doddridge County",3]
[null,null,null,null,null,null,null,null,null,null,null,null,null,"West Virginia","Fayette County",3]
[null,null,null,null,null,null,null,null,null,null,null,null,null,"West Virginia","Gilmer County",3]
[null,null,null,null,null,null,null,null,null,null,null,null,null,"West Virginia","Grant County",2]
[null,null,null,null,null,null,null,null,null,null,null,null,null,"West Virginia","Greenbrier County",3]
[null,null,null,null,null,null,null,null,null,null,null,null,null,"West Virginia","Hampshire County",2]
[null,null,null,null,null,null,null,null,null,null,null,null,null,"West Virginia","Hancock County",2]
[null,null,null,null,null,null,null,null,null,null,null,null,null,"West Virginia","Hardy County",2]
[null,null,null,null,null,null,null,null,null,null,null,null,null,"West Virginia","Harrison County",3]
[null,null,null,null,null,null,null,null,null,null,null,null,null,"West Virginia","Jackson County",3]
[null,null,null,null,null,null,null,null,null,null,null,null,null,"West Virginia","Jefferson County",2]
[null,null,null,null,null,null,null,null,null,null,null,null,null,"West Virginia","Kanawha County",3]
[null,null,null,null,null,null,null,null,null,null,null,null,null,"West Virginia","Lewis County",3]
[null,null,null,null,null,null,null,null,null,null,null,null,null,"West Virginia","Lincoln County",6]
[null,null,null,null,null,null,null,null,null,null,null,null,null,"West Virginia","Logan County",6]
[null,null,null,null,null,null,null,null,null,null,null,null,null,"West Virginia","Marion County",2]
[null,null,null,null,null,null,null,null,null,null,null,null,null,"West Virginia","Marshall County",2]
[null,null,null,null,null,null,null,null,null,null,null,null,null,"West Virginia","Mason County",2]
[null,null,null,null,null,null,null,null,null,null,null,null,null,"West Virginia","McDowell County",3]
[null,null,null,null,null,null,null,null,null,null,null,null,null,"West Virginia","Mercer County",3]
[null,null,null,null,null,null,null,null,null,null,null,null,null,"West Virginia","Mineral County",2]
[null,null,null,null,null,null,null,null,null,null,null,null,null,"West Virginia","Mingo County",6]
[null,null,null,null,null,null,null,null,null,null,null,null,null,"West Virginia","Monongalia County",3]
[null,null,null,null,null,null,null,null,null,null,null,null,null,"West Virginia","Monroe County",3]
[null,null,null,null,null,null,null,null,null,null,null,null,null,"West Virginia","Morgan County",2]
[null,null,null,null,null,null,null,null,null,null,null,null,null,"West Virginia","Nicholas County",3]
[null,null,null,null,null,null,null,null,null,null,null,null,null,"West Virginia","Ohio County",3]
[null,null,null,null,null,null,null,null,null,null,null,null,null,"West Virginia","Pendleton County",2]
[null,null,null,null,null,null,null,null,null,null,null,null,null,"West Virginia","Pleasants County",3]
[null,null,null,null,null,null,null,null,null,null,null,null,null,"West Virginia","Pocahontas County",3]
[null,null,null,null,null,null,null,null,null,null,null,null,null,"West Virginia","Preston County",2]
[null,null,null,null,null,null,null,null,null,null,null,null,null,"West Virginia","Putnam County",3]
[null,null,null,null,null,null,null,null,null,null,null,null,null,"West Virginia","Raleigh County",3]
[null,null,null,null,null,null,null,null,null,null,null,null,null,"West Virginia","Randolph County",3]
[null,null,null,null,null,null,null,null,null,null,null,null,null,"West Virginia","Ritchie County",2]
[null,null,null,null,null,null,null,null,null,null,null,null,null,"West Virginia","Roane County",3]
[null,null,null,null,null,null,null,null,null,null,null,null,null,"West Virginia","Summers County",3]
[null,null,null,null,null,null,null,null,null,null,null,null,null,"West Virginia","Taylor County",2]
[null,null,null,null,null,null,null,null,null,null,null,null,null,"West Virginia","Tucker County",2]
[null,null,null,null,null,null,null,null,null,null,null,null,null,"West Virginia","Tyler County",2]
[null,null,null,null,null,null,null,null,null,null,null,null,null,"West Virginia","Upshur County",3]
[null,null,null,null,null,null,null,null,null,null,null,null,null,"West Virginia","Wayne County",3]
[null,null,null,null,null,null,null,null,null,null,null,null,null,"West Virginia","Webster County",3]
[null,null,null,null,null,null,null,null,null,null,null,null,null,"West Virginia","Wetzel County",3]
[null,null,null,null,null,null,null,null,null,null,null,null,null,"West Virginia","Wirt County",2]
[null,null,null,null,null,null,null,null,null,null,null,null,null,"West Virginia","Wood County",2]
[null,null,null,null,null,null,null,null,null,null,null,null,null,"West Virginia","Wyoming County",3]
[null,null,null,null,null,null,null,null,null,null,null,null,null,"Wisconsin","Adams County",3]
[null,null,null,null,null,null,null,null,null,null,null,null,null,"Wisconsin","Ashland County",3]
[null,null,null,null,null,null,null,null,null,null,null,null,null,"Wisconsin","Barron County",2]
[null,null,null,null,null,null,null,null,null,null,null,null,null,"Wisconsin","Bayfield County",2]
[null,null,null,null,null,null,null,null,null,null,null,null,null,"Wisconsin","Brown County",2]
[null,null,null,null,null,null,null,null,null,null,null,null,null,"Wisconsin","Buffalo County",2]
[null,null,null,null,null,null,null,null,null,null,null,null,null,"Wisconsin","Burnett County",2]
[null,null,null,null,null,null,null,null,null,null,null,null,null,"Wisconsin","Calumet County",2]
[null,null,null,null,null,null,null,null,null,null,null,null,null,"Wisconsin","Chippewa County",2]
[null,null,null,null,null,null,null,null,null,null,null,null,null,"Wisconsin","Clark County",2]
[null,null,null,null,null,null,null,null,null,null,null,null,null,"Wisconsin","Columbia County",2]
[null,null,null,null,null,null,null,null,null,null,null,null,null,"Wisconsin","Crawford County",3]
[null,null,null,null,null,null,null,null,null,null,null,null,null,"Wisconsin","Dane County",2]
[null,null,null,null,null,null,null,null,null,null,null,null,null,"Wisconsin","Dodge County",2]
[null,null,null,null,null,null,null,null,null,null,null,null,null,"Wisconsin","Door County",2]
[null,null,null,null,null,null,null,null,null,null,null,null,null,"Wisconsin","Douglas County",3]
[null,null,null,null,null,null,null,null,null,null,null,null,null,"Wisconsin","Dunn County",2]
[null,null,null,null,null,null,null,null,null,null,null,null,null,"Wisconsin","Eau Claire County",2]
[null,null,null,null,null,null,null,null,null,null,null,null,null,"Wisconsin","Florence County",3]
[null,null,null,null,null,null,null,null,null,null,null,null,null,"Wisconsin","Fond du Lac County",2]
[null,null,null,null,null,null,null,null,null,null,null,null,null,"Wisconsin","Forest County",3]
[null,null,null,null,null,null,null,null,null,null,null,null,null,"Wisconsin","Grant County",2]
[null,null,null,null,null,null,null,null,null,null,null,null,null,"Wisconsin","Green County",2]
[null,null,null,null,null,null,null,null,null,null,null,null,null,"Wisconsin","Green Lake County",2]
[null,null,null,null,null,null,null,null,null,null,null,null,null,"Wisconsin","Iowa County",2]
[null,null,null,null,null,null,null,null,null,null,null,null,null,"Wisconsin","Iron County",3]
[null,null,null,null,null,null,null,null,null,null,null,null,null,"Wisconsin","Jackson County",2]
[null,null,null,null,null,null,null,null,null,null,null,null,null,"Wisconsin","Jefferson County",2]
[null,null,null,null,null,null,null,null,null,null,null,null,null,"Wisconsin","Juneau County",3]
[null,null,null,null,null,null,null,null,null,null,null,null,null,"Wisconsin","Kenosha County",2]
[null,null,null,null,null,null,null,null,null,null,null,null,null,"Wisconsin","Kewaunee County",2]
[null,null,null,null,null,null,null,null,null,null,null,null,null,"Wisconsin","La Crosse County",3]
[null,null,null,null,null,null,null,null,null,null,null,null,null,"Wisconsin","Lafayette County",2]
[null,null,null,null,null,null,null,null,null,null,null,null,null,"Wisconsin","Langlade County",3]
[null,null,null,null,null,null,null,null,null,null,null,null,null,"Wisconsin","Lincoln County",3]
[null,null,null,null,null,null,null,null,null,null,null,null,null,"Wisconsin","Manitowoc County",2]
[null,null,null,null,null,null,null,null,null,null,null,null,null,"Wisconsin","Marathon County",2]
[null,null,null,null,null,null,null,null,null,null,null,null,null,"Wisconsin","Marinette County",3]
[null,null,null,null,null,null,null,null,null,null,null,null,null,"Wisconsin","Marquette County",3]
[null,null,null,null,null,null,null,null,null,null,null,null,null,"Wisconsin","Menominee County",2]
[null,null,null,null,null,null,null,null,null,null,null,null,null,"Wisconsin","Milwaukee County",2]
[null,null,null,null,null,null,null,null,null,null,null,null,null,"Wisconsin","Monroe County",3]
[null,null,null,null,null,null,null,null,null,null,null,null,null,"Wisconsin","Oconto County",3]
[null,null,null,null,null,null,null,null,null,null,null,null,null,"Wisconsin","Oneida County",3]
[null,null,null,null,null,null,null,null,null,null,null,null,null,"Wisconsin","Outagamie County",2]
[null,null,null,null,null,null,null,null,null,null,null,null,null,"Wisconsin","Ozaukee County",2]
[null,null,null,null,null,null,null,null,null,null,null,null,null,"Wisconsin","Pepin County",2]
[null,null,null,null,null,null,null,null,null,null,null,null,null,"Wisconsin","Pierce County",2]
[null,null,null,null,null,null,null,null,null,null,null,null,null,"Wisconsin","Polk County",2]
[null,null,null,null,null,null,null,null,null,null,null,null,null,"Wisconsin","Portage County",3]
[null,null,null,null,null,null,null,null,null,null,null,null,null,"Wisconsin","Price County",2]
[null,null,null,null,null,null,null,null,null,null,null,null,null,"Wisconsin","Racine County",2]
[null,null,null,null,null,null,null,null,null,null,null,null,null,"Wisconsin","Richland County",2]
[null,null,null,null,null,null,null,null,null,null,null,null,null,"Wisconsin","Rock County",2]
[null,null,null,null,null,null,null,null,null,null,null,null,null,"Wisconsin","Rusk County",2]
[null,null,null,null,null,null,null,null,null,null,null,null,null,"Wisconsin","Sauk County",2]
[null,null,null,null,null,null,null,null,null,null,null,null,null,"Wisconsin","Sawyer County",3]
[null,null,null,null,null,null,null,null,null,null,null,null,null,"Wisconsin","Shawano County",2]
[null,null,null,null,null,null,null,null,null,null,null,null,null,"Wisconsin","Sheboygan County",2]
[null,null,null,null,null,null,null,null,null,null,null,null,null,"Wisconsin","St. Croix County",2]
[null,null,null,null,null,null,null,null,null,null,null,null,null,"Wisconsin","Taylor County",2]
[null,null,null,null,null,null,null,null,null,null,null,null,null,"Wisconsin","Trempealeau County",2]
[null,null,null,null,null,null,null,null,null,null,null,null,null,"Wisconsin","Vernon County",2]
[null,null,null,null,null,null,null,null,null,null,null,null,null,"Wisconsin","Vilas County",3]
[null,null,null,null,null,null,null,null,null,null,null,null,null,"Wisconsin","Walworth County",2]
[null,null,null,null,null,null,null,null,null,null,null,null,null,"Wisconsin","Washburn County",2]
[null,null,null,null,null,null,null,null,null,null,null,null,null,"Wisconsin","Washington County",2]
[null,null,null,null,null,null,null,null,null,null,null,null,null,"Wisconsin","Waukesha County",2]
[null,null,null,null,null,null,null,null,null,null,null,null,null,"Wisconsin","Waupaca County",3]
[null,null,null,null,null,null,null,null,null,null,null,null,null,"Wisconsin","Waushara County",3]
[null,null,null,null,null,null,null,null,null,null,null,null,null,"Wisconsin","Winnebago County",2]
[null,null,null,null,null,null,null,null,null,null,null,null,null,"Wisconsin","Wood County",2]
[null,null,null,null,null,null,null,null,null,null,null,null,null,"Wyoming","Albany County",3]
[null,null,null,null,null,null,null,null,null,null,null,null,null,"Wyoming","Big Horn County",3]
[null,null,null,null,null,null,null,null,null,null,null,null,null,"Wyoming","Campbell County",3]
[null,null,null,null,null,null,null,null,null,null,null,null,null,"Wyoming","Carbon County",3]
[null,null,null,null,null,null,null,null,null,null,null,null,null,"Wyoming","Converse County",3]
[null,null,null,null,null,null,null,null,null,null,null,null,null,"Wyoming","Crook County",3]
[null,null,null,null,null,null,null,null,null,null,null,null,null,"Wyoming","Fremont County",3]
[null,null,null,null,null,null,null,null,null,null,null,null,null,"Wyoming","Goshen County",3]
[null,null,null,null,null,null,null,null,null,null,null,null,null,"Wyoming","Hot Springs County",3]
[null,null,null,null,null,null,null,null,null,null,null,null,null,"Wyoming","Johnson County",3]
[null,null,null,null,null,null,null,null,null,null,null,null,null,"Wyoming","Laramie County",3]
[null,null,null,null,null,null,null,null,null,null,null,null,null,"Wyoming","Lincoln County",3]
[null,null,null,null,null,null,null,null,null,null,null,null,null,"Wyoming","Natrona County",3]
[null,null,null,null,null,null,null,null,null,null,null,null,null,"Wyoming","Niobrara County",3]
[null,null,null,null,null,null,null,null,null,null,null,null,null,"Wyoming","Park County",3]
[null,null,null,null,null,null,null,null,null,null,null,null,null,"Wyoming","Platte County",3]
[null,null,null,null,null,null,null,null,null,null,null,null,null,"Wyoming","Sheridan County",3]
[null,null,null,null,null,null,null,null,null,null,null,null,null,"Wyoming","Sublette County",3]
[null,null,null,null,null,null,null,null,null,null,null,null,null,"Wyoming","Sweetwater County",3]
[null,null,null,null,null,null,null,null,null,null,null,null,null,"Wyoming","Teton County",2]
[null,null,null,null,null,null,null,null,null,null,null,null,null,"Wyoming","Uinta County",3]
[null,null,null,null,null,null,null,null,null,null,null,null,null,"Wyoming","Washakie County",3]
[null,null,null,null,null,null,null,null,null,null,null,null,null,"Wyoming","Weston County",3]